BDBM50331024 (Z)-2-(5-Chloro-2-oxo-1,2-dihydro-indol-3-ylidenemethyl)-5-(2-diethylamino-ethyl)-3-methyl-1,5,6,7-tetrahydro-pyrrolo[3,2-c]pyridin-4-one::CHEMBL1278147
SMILES: CCN(CC)CCN1CCc2[nH]c(\C=C3/C(=O)Nc4ccc(Cl)cc34)c(C)c2C1=O
InChI Key: InChIKey=CCIRQCXOVCNPBI-LGMDPLHJSA-N
Data: 4 IC50
Activity Spreadsheet -- Enzyme Inhibition Constant Data from BindingDB
Found 4 hits for monomerid = 50331024
Trg + Lig
Ki
nM
ΔG°
kcal/mole
IC50
nM
Kd
nM
EC50/IC50
nM
koff
s-1
kon
M-1s-1
pHTemp
°C
Vascular endothelial growth factor receptor 2
(Homo sapiens (Human))
BDBM50331024
((Z)-2-(5-Chloro-2-oxo-1,2-dihydro-indol-3-ylidenem...)
Show SMILES CCN(CC)CCN1CCc2[nH]c(\C=C3/C(=O)Nc4ccc(Cl)cc34)c(C)c2C1=O
Show InChI InChI=1S/C23H27ClN4O2/c1-4-27(5-2)10-11-28-9-8-19-21(23(28)30)14(3)20(25-19)13-17-16-12-15(24)6-7-18(16)26-22(17)29/h6-7,12-13,25H,4-5,8-11H2,1-3H3,(H,26,29)/b17-13-
NCI pathway
Reactome pathway
n/an/a 10n/an/an/an/an/an/a
Shanghai Hengrui Pharmaceuticals Co., Ltd.
Curated by ChEMBL
Assay Description
Inhibition of human VEGFR2 after 30 mins by ELISA
J Med Chem 53: 8140-9 (2010)
Article DOI: 10.1021/jm101036c
BindingDB Entry DOI: 10.7270/Q2BV7GWF
Vascular endothelial growth factor receptor 2
(Homo sapiens (Human))
BDBM50331024
((Z)-2-(5-Chloro-2-oxo-1,2-dihydro-indol-3-ylidenem...)
Show SMILES CCN(CC)CCN1CCc2[nH]c(\C=C3/C(=O)Nc4ccc(Cl)cc34)c(C)c2C1=O
Show InChI InChI=1S/C23H27ClN4O2/c1-4-27(5-2)10-11-28-9-8-19-21(23(28)30)14(3)20(25-19)13-17-16-12-15(24)6-7-18(16)26-22(17)29/h6-7,12-13,25H,4-5,8-11H2,1-3H3,(H,26,29)/b17-13-
NCI pathway
Reactome pathway
n/an/a 410n/an/an/an/an/an/a
Shanghai Hengrui Pharmaceuticals Co., Ltd.
Curated by ChEMBL
Assay Description
Inhibition of VEGFR2-induced cell proliferation in HUVEC after 72 hrs by sulforhodamine B method
J Med Chem 53: 8140-9 (2010)
Article DOI: 10.1021/jm101036c
BindingDB Entry DOI: 10.7270/Q2BV7GWF
Mast/stem cell growth factor receptor Kit
(Homo sapiens (Human))
BDBM50331024
((Z)-2-(5-Chloro-2-oxo-1,2-dihydro-indol-3-ylidenem...)
Show SMILES CCN(CC)CCN1CCc2[nH]c(\C=C3/C(=O)Nc4ccc(Cl)cc34)c(C)c2C1=O
Show InChI InChI=1S/C23H27ClN4O2/c1-4-27(5-2)10-11-28-9-8-19-21(23(28)30)14(3)20(25-19)13-17-16-12-15(24)6-7-18(16)26-22(17)29/h6-7,12-13,25H,4-5,8-11H2,1-3H3,(H,26,29)/b17-13-
n/an/a 4n/an/an/an/an/an/a
Shanghai Hengrui Pharmaceuticals Co., Ltd.
Curated by ChEMBL
Assay Description
Inhibition of c-Kit after 30 mins by ELISA
J Med Chem 53: 8140-9 (2010)
Article DOI: 10.1021/jm101036c
BindingDB Entry DOI: 10.7270/Q2BV7GWF
Platelet-derived growth factor receptor beta
(Homo sapiens (Human))
BDBM50331024
((Z)-2-(5-Chloro-2-oxo-1,2-dihydro-indol-3-ylidenem...)
Show SMILES CCN(CC)CCN1CCc2[nH]c(\C=C3/C(=O)Nc4ccc(Cl)cc34)c(C)c2C1=O
Show InChI InChI=1S/C23H27ClN4O2/c1-4-27(5-2)10-11-28-9-8-19-21(23(28)30)14(3)20(25-19)13-17-16-12-15(24)6-7-18(16)26-22(17)29/h6-7,12-13,25H,4-5,8-11H2,1-3H3,(H,26,29)/b17-13-
NCI pathway
Reactome pathway
n/an/a 2n/an/an/an/an/an/a
Shanghai Hengrui Pharmaceuticals Co., Ltd.
Curated by ChEMBL
Assay Description
Inhibition of human PDGFRbeta after 30 mins by ELISA
J Med Chem 53: 8140-9 (2010)
Article DOI: 10.1021/jm101036c
BindingDB Entry DOI: 10.7270/Q2BV7GWF