BDBM50335097 6-(methylsulfonyl)benzo[d]thiazol-2-amine::6-Methanesulfonyl-benzothiazol-2-ylamine::CHEMBL432942
SMILES: CS(=O)(=O)c1ccc2nc(N)sc2c1
InChI Key: InChIKey=ZYHNHJAMVNINSY-UHFFFAOYSA-N
Data: 1 KI  10 IC50
PDB links: 1 PDB ID matches this monomer.
Activity Spreadsheet -- Enzyme Inhibition Constant Data from BindingDB
Found 11 hits for monomerid = 50335097
Trg + Lig
Ki
nM
ΔG°
kcal/mole
IC50
nM
Kd
nM
EC50/IC50
nM
koff
s-1
kon
M-1s-1
pHTemp
°C
Pteridine reductase 1
(Leishmania major)
BDBM50335097
(6-(methylsulfonyl)benzo[d]thiazol-2-amine | 6-Meth...)
Show SMILES CS(=O)(=O)c1ccc2nc(N)sc2c1
Show InChI InChI=1S/C8H8N2O2S2/c1-14(11,12)5-2-3-6-7(4-5)13-8(9)10-6/h2-4H,1H3,(H2,9,10)
1.60E+4n/an/an/an/an/an/an/an/a
Rutgers University
Curated by ChEMBL
Assay Description
Inhibition of Leishmania major PTR1 by Lineweaver-Burk analysis
J Agric Food Chem 59: 56-61 (2011)
Article DOI: 10.1021/jm1010572
BindingDB Entry DOI: 10.7270/Q27W6D6P
Thymidylate synthase (TS)
(Leishmania major)
BDBM50335097
(6-(methylsulfonyl)benzo[d]thiazol-2-amine | 6-Meth...)
Show SMILES CS(=O)(=O)c1ccc2nc(N)sc2c1
Show InChI InChI=1S/C8H8N2O2S2/c1-14(11,12)5-2-3-6-7(4-5)13-8(9)10-6/h2-4H,1H3,(H2,9,10)
n/an/a 1.79E+6n/an/an/an/an/an/a
Rutgers University
Curated by ChEMBL
Assay Description
Inhibition of Leishmania major DHFR
J Agric Food Chem 59: 56-61 (2011)
Article DOI: 10.1021/jm1010572
BindingDB Entry DOI: 10.7270/Q27W6D6P
Dihydrofolate reductase
(Homo sapiens (Human))
BDBM50335097
(6-(methylsulfonyl)benzo[d]thiazol-2-amine | 6-Meth...)
Show SMILES CS(=O)(=O)c1ccc2nc(N)sc2c1
Show InChI InChI=1S/C8H8N2O2S2/c1-14(11,12)5-2-3-6-7(4-5)13-8(9)10-6/h2-4H,1H3,(H2,9,10)
NCI pathway
Reactome pathway
n/an/a 1.04E+6n/an/an/an/an/an/a
Rutgers University
Curated by ChEMBL
Assay Description
Inhibition of human DHFR
J Agric Food Chem 59: 56-61 (2011)
Article DOI: 10.1021/jm1010572
BindingDB Entry DOI: 10.7270/Q27W6D6P
Cytochrome P450 2C9
(Homo sapiens (Human))
BDBM50335097
(6-(methylsulfonyl)benzo[d]thiazol-2-amine | 6-Meth...)
Show SMILES CS(=O)(=O)c1ccc2nc(N)sc2c1
Show InChI InChI=1S/C8H8N2O2S2/c1-14(11,12)5-2-3-6-7(4-5)13-8(9)10-6/h2-4H,1H3,(H2,9,10)
Reactome pathway
n/an/a>2.50E+4n/an/an/an/an/an/a
University of Modena and Reggio Emilia
Curated by ChEMBL
Assay Description
Inhibition of human CYP2C9 expressed in baculovirus infected insect cells using beetle D-luciferin as substrate preincubated for 30 mins followed by ...
J Med Chem 62: 3989-4012 (2019)
Article DOI: 10.1021/acs.jmedchem.8b02021
Cytochrome P450 2D6
(Homo sapiens (Human))
BDBM50335097
(6-(methylsulfonyl)benzo[d]thiazol-2-amine | 6-Meth...)
Show SMILES CS(=O)(=O)c1ccc2nc(N)sc2c1
Show InChI InChI=1S/C8H8N2O2S2/c1-14(11,12)5-2-3-6-7(4-5)13-8(9)10-6/h2-4H,1H3,(H2,9,10)
n/an/a>2.50E+4n/an/an/an/an/an/a
University of Modena and Reggio Emilia
Curated by ChEMBL
Assay Description
Inhibition of human CYP2D6 expressed in baculovirus infected insect cells using beetle D-luciferin as substrate preincubated for 30 mins followed by ...
J Med Chem 62: 3989-4012 (2019)
Article DOI: 10.1021/acs.jmedchem.8b02021
Cytochrome P450 3A4
(Homo sapiens (Human))
BDBM50335097
(6-(methylsulfonyl)benzo[d]thiazol-2-amine | 6-Meth...)
Show SMILES CS(=O)(=O)c1ccc2nc(N)sc2c1
Show InChI InChI=1S/C8H8N2O2S2/c1-14(11,12)5-2-3-6-7(4-5)13-8(9)10-6/h2-4H,1H3,(H2,9,10)
Reactome pathway
n/an/a>2.50E+4n/an/an/an/an/an/a
University of Modena and Reggio Emilia
Curated by ChEMBL
Assay Description
Inhibition of human CYP3A4 expressed in baculovirus infected insect cells using beetle D-luciferin as substrate preincubated for 30 mins followed by ...
J Med Chem 62: 3989-4012 (2019)
Article DOI: 10.1021/acs.jmedchem.8b02021
Pteridine reductase 1
(Leishmania major)
BDBM50335097
(6-(methylsulfonyl)benzo[d]thiazol-2-amine | 6-Meth...)
Show SMILES CS(=O)(=O)c1ccc2nc(N)sc2c1
Show InChI InChI=1S/C8H8N2O2S2/c1-14(11,12)5-2-3-6-7(4-5)13-8(9)10-6/h2-4H,1H3,(H2,9,10)
n/an/a 3.29E+4n/an/an/an/an/an/a
University of Modena and Reggio Emilia
Curated by ChEMBL
Assay Description
Inhibition of Leishmania major pteridine reductase 1 using di-hydrobiopterine as substrate in presence of NADPH
J Med Chem 62: 3989-4012 (2019)
Article DOI: 10.1021/acs.jmedchem.8b02021
1,3-beta-glucan synthase component GLS2
(Saccharomyces cerevisiae)
BDBM50335097
(6-(methylsulfonyl)benzo[d]thiazol-2-amine | 6-Meth...)
Show SMILES CS(=O)(=O)c1ccc2nc(N)sc2c1
Show InChI InChI=1S/C8H8N2O2S2/c1-14(11,12)5-2-3-6-7(4-5)13-8(9)10-6/h2-4H,1H3,(H2,9,10)
n/an/a>2.50E+4n/an/an/an/an/an/a
University of Modena and Reggio Emilia
Curated by ChEMBL
Assay Description
Displacement of Tracer Red from human ERG by fluorescence polarization assay
J Med Chem 62: 3989-4012 (2019)
Article DOI: 10.1021/acs.jmedchem.8b02021
Cytochrome P450 1A2
(Homo sapiens (Human))
BDBM50335097
(6-(methylsulfonyl)benzo[d]thiazol-2-amine | 6-Meth...)
Show SMILES CS(=O)(=O)c1ccc2nc(N)sc2c1
Show InChI InChI=1S/C8H8N2O2S2/c1-14(11,12)5-2-3-6-7(4-5)13-8(9)10-6/h2-4H,1H3,(H2,9,10)
n/an/a>2.50E+4n/an/an/an/an/an/a
University of Modena and Reggio Emilia
Curated by ChEMBL
Assay Description
Inhibition of human CYP1A2 expressed in baculovirus infected insect cells using beetle D-luciferin as substrate preincubated for 30 mins followed by ...
J Med Chem 62: 3989-4012 (2019)
Article DOI: 10.1021/acs.jmedchem.8b02021
Pteridine reductase 1
(Leishmania major)
BDBM50335097
(6-(methylsulfonyl)benzo[d]thiazol-2-amine | 6-Meth...)
Show SMILES CS(=O)(=O)c1ccc2nc(N)sc2c1
Show InChI InChI=1S/C8H8N2O2S2/c1-14(11,12)5-2-3-6-7(4-5)13-8(9)10-6/h2-4H,1H3,(H2,9,10)
n/an/a 2.12E+5n/an/an/an/an/an/a
Rutgers University
Curated by ChEMBL
Assay Description
Inhibition of Leishmania major PTR1
J Agric Food Chem 59: 56-61 (2011)
Article DOI: 10.1021/jm1010572
BindingDB Entry DOI: 10.7270/Q27W6D6P
Cytochrome P450 2C19
(Homo sapiens (Human))
BDBM50335097
(6-(methylsulfonyl)benzo[d]thiazol-2-amine | 6-Meth...)
Show SMILES CS(=O)(=O)c1ccc2nc(N)sc2c1
Show InChI InChI=1S/C8H8N2O2S2/c1-14(11,12)5-2-3-6-7(4-5)13-8(9)10-6/h2-4H,1H3,(H2,9,10)
Reactome pathway
n/an/a>2.50E+4n/an/an/an/an/an/a
University of Modena and Reggio Emilia
Curated by ChEMBL
Assay Description
Inhibition of human CYP2C19 expressed in baculovirus infected insect cells using beetle D-luciferin as substrate preincubated for 30 mins followed by...
J Med Chem 62: 3989-4012 (2019)
Article DOI: 10.1021/acs.jmedchem.8b02021