BDBM50337831 CHEMBL1683899::N,N-dimethyl-1-(1-(naphthalen-1-yl)cyclohexyl)methanamine::US10562878, Compound 53
SMILES: CN(C)CC1(CCCCC1)c1cccc2ccccc12
InChI Key: InChIKey=UTQLEVQLADDVHS-UHFFFAOYSA-N
Data: 8 IC50
Activity Spreadsheet -- Enzyme Inhibition Constant Data from BindingDB
Found 8 hits for monomerid = 50337831
Trg + Lig
Ki
nM
ΔG°
kcal/mole
IC50
nM
Kd
nM
EC50/IC50
nM
koff
s-1
kon
M-1s-1
pHTemp
°C
Sodium-dependent dopamine transporter
(Homo sapiens (Human))
BDBM50337831
(CHEMBL1683899 | N,N-dimethyl-1-(1-(naphthalen-1-yl...)
Show SMILES CN(C)CC1(CCCCC1)c1cccc2ccccc12
Show InChI InChI=1S/C19H25N/c1-20(2)15-19(13-6-3-7-14-19)18-12-8-10-16-9-4-5-11-17(16)18/h4-5,8-12H,3,6-7,13-15H2,1-2H3
NCI pathway
Reactome pathway
n/an/a 1n/an/an/an/an/an/a
Sunovion Pharmaceuticals Inc.
Curated by ChEMBL
Assay Description
Inhibition of human recombinant dopamine transporter
Bioorg Med Chem Lett 21: 1438-41 (2011)
Article DOI: 10.1016/j.bmcl.2011.01.016
BindingDB Entry DOI: 10.7270/Q2S46S72
Sodium-dependent noradrenaline transporter
(Homo sapiens (Human))
BDBM50337831
(CHEMBL1683899 | N,N-dimethyl-1-(1-(naphthalen-1-yl...)
Show SMILES CN(C)CC1(CCCCC1)c1cccc2ccccc12
Show InChI InChI=1S/C19H25N/c1-20(2)15-19(13-6-3-7-14-19)18-12-8-10-16-9-4-5-11-17(16)18/h4-5,8-12H,3,6-7,13-15H2,1-2H3
Reactome pathway
n/an/a 20n/an/an/an/an/an/a
Sunovion Pharmaceuticals Inc.
Curated by ChEMBL
Assay Description
Inhibition of human recombinant Norepinephrine transporter
Bioorg Med Chem Lett 21: 1438-41 (2011)
Article DOI: 10.1016/j.bmcl.2011.01.016
BindingDB Entry DOI: 10.7270/Q2S46S72
Sodium-dependent serotonin transporter
(Homo sapiens (Human))
BDBM50337831
(CHEMBL1683899 | N,N-dimethyl-1-(1-(naphthalen-1-yl...)
Show SMILES CN(C)CC1(CCCCC1)c1cccc2ccccc12
Show InChI InChI=1S/C19H25N/c1-20(2)15-19(13-6-3-7-14-19)18-12-8-10-16-9-4-5-11-17(16)18/h4-5,8-12H,3,6-7,13-15H2,1-2H3
US Patent
n/an/a<1n/an/an/an/an/an/a
SUNOVION PHARAMCEUTICALS INC.
US Patent
Assay Description
Inhibition of human serotonin reuptake transporter was assayed using the recombinant human serotonin transporter expressed in HEK-293 cells. HEK-293 ...
US Patent US10562878 (2020)
BindingDB Entry DOI: 10.7270/Q2XP77BX
Monoamine transporters; Norepininephrine & dopamine
(Rattus norvegicus (rat))
BDBM50337831
(CHEMBL1683899 | N,N-dimethyl-1-(1-(naphthalen-1-yl...)
Show SMILES CN(C)CC1(CCCCC1)c1cccc2ccccc12
Show InChI InChI=1S/C19H25N/c1-20(2)15-19(13-6-3-7-14-19)18-12-8-10-16-9-4-5-11-17(16)18/h4-5,8-12H,3,6-7,13-15H2,1-2H3
Reactome pathway
US Patent
n/an/a 6.10n/an/an/an/an/an/a
SUNOVION PHARAMCEUTICALS INC.
US Patent
Assay Description
Quantification of dopamine uptake was performed using synaptosomes isolated in a 0.32 M sucrose buffer from a male Wistar rat striatum. The uptake of...
US Patent US10562878 (2020)
BindingDB Entry DOI: 10.7270/Q2XP77BX
Monoamine transporter
(Homo sapiens (Human))
BDBM50337831
(CHEMBL1683899 | N,N-dimethyl-1-(1-(naphthalen-1-yl...)
Show SMILES CN(C)CC1(CCCCC1)c1cccc2ccccc12
Show InChI InChI=1S/C19H25N/c1-20(2)15-19(13-6-3-7-14-19)18-12-8-10-16-9-4-5-11-17(16)18/h4-5,8-12H,3,6-7,13-15H2,1-2H3
NCI pathway
Reactome pathway
US Patent
n/an/a 1n/an/an/an/an/an/a
SUNOVION PHARAMCEUTICALS INC.
US Patent
Assay Description
Inhibition of human dopamine reuptake transporter was assayed using the recombinant human dopamine transporter expressed in either CHO-K1 or HEK293 c...
US Patent US10562878 (2020)
BindingDB Entry DOI: 10.7270/Q2XP77BX
Monoamine transporters; Norepinephrine & serotonin
(Rattus norvegicus (rat))
BDBM50337831
(CHEMBL1683899 | N,N-dimethyl-1-(1-(naphthalen-1-yl...)
Show SMILES CN(C)CC1(CCCCC1)c1cccc2ccccc12
Show InChI InChI=1S/C19H25N/c1-20(2)15-19(13-6-3-7-14-19)18-12-8-10-16-9-4-5-11-17(16)18/h4-5,8-12H,3,6-7,13-15H2,1-2H3
US Patent
n/an/a 6.5n/an/an/an/an/an/a
SUNOVION PHARAMCEUTICALS INC.
US Patent
Assay Description
Quantification of 5-HT uptake was performed using synaptosomes isolated in a 0.32M sucrose buffer from a male Wistar rat cortex. The uptake of radiol...
US Patent US10562878 (2020)
BindingDB Entry DOI: 10.7270/Q2XP77BX
Neuroepithelial cell-transforming 1
(Rat)
BDBM50337831
(CHEMBL1683899 | N,N-dimethyl-1-(1-(naphthalen-1-yl...)
Show SMILES CN(C)CC1(CCCCC1)c1cccc2ccccc12
Show InChI InChI=1S/C19H25N/c1-20(2)15-19(13-6-3-7-14-19)18-12-8-10-16-9-4-5-11-17(16)18/h4-5,8-12H,3,6-7,13-15H2,1-2H3
NCI pathway
Reactome pathway
US Patent
n/an/a 2.90n/an/an/an/an/an/a
SUNOVION PHARAMCEUTICALS INC.
US Patent
Assay Description
Quantification of norepinephrine uptake was performed using synaptosomes isolated in a 0.32 M sucrose buffer from a male Wistar rat hypothalamus. The...
US Patent US10562878 (2020)
BindingDB Entry DOI: 10.7270/Q2XP77BX
Neuroepithelial cell-transforming gene 1 protein
(Homo sapiens)
BDBM50337831
(CHEMBL1683899 | N,N-dimethyl-1-(1-(naphthalen-1-yl...)
Show SMILES CN(C)CC1(CCCCC1)c1cccc2ccccc12
Show InChI InChI=1S/C19H25N/c1-20(2)15-19(13-6-3-7-14-19)18-12-8-10-16-9-4-5-11-17(16)18/h4-5,8-12H,3,6-7,13-15H2,1-2H3
US Patent
n/an/a 20n/an/an/an/an/an/a
SUNOVION PHARAMCEUTICALS INC.
US Patent
Assay Description
Inhibition of human norepinephrine reuptake transporter was assayed using the recombinant human norepinephrine transporter expressed in either HEK293...
US Patent US10562878 (2020)
BindingDB Entry DOI: 10.7270/Q2XP77BX