BDBM50345711 3-(naphthalen-1-ylmethyl)-1-(piperidin-4-yl)-1H-pyrazolo[3,4-d]pyrimidin-4-amine::CHEMBL1784964::US10544104, Compound 5g::US9765037, Compound 5g
SMILES: Nc1ncnc2n(nc(Cc3cccc4ccccc34)c12)C1CCNCC1
InChI Key: InChIKey=OTWGEGUQDHMDBA-UHFFFAOYSA-N
Data: 7 IC50
Activity Spreadsheet -- Enzyme Inhibition Constant Data from BindingDB
Found 7 hits for monomerid = 50345711
Trg + Lig
Ki
nM
ΔG°
kcal/mole
IC50
nM
Kd
nM
EC50/IC50
nM
koff
s-1
kon
M-1s-1
pHTemp
°C
Calmodulin-domain protein kinase 1 (CDPK1)
(Toxoplasma gondii)
BDBM50345711
(3-(naphthalen-1-ylmethyl)-1-(piperidin-4-yl)-1H-py...)
Show SMILES Nc1ncnc2n(nc(Cc3cccc4ccccc34)c12)C1CCNCC1
Show InChI InChI=1S/C21H22N6/c22-20-19-18(12-15-6-3-5-14-4-1-2-7-17(14)15)26-27(21(19)25-13-24-20)16-8-10-23-11-9-16/h1-7,13,16,23H,8-12H2,(H2,22,24,25)
n/an/a 59n/an/an/an/an/an/a
University of Washington.
Curated by ChEMBL
Assay Description
Inhibition of Toxoplasma gondii recombinant N-terminal hexahistidine tagged CDPK1 expressed in Escherichia coli using syntide-2 as substrate after 90...
ACS Med Chem Lett 1: 331-335 (2011)
Article DOI: 10.1021/ml100096t
BindingDB Entry DOI: 10.7270/Q2JW8FV5
Calmodulin-domain protein kinase 1 (CDPK1)
(Toxoplasma gondii)
BDBM50345711
(3-(naphthalen-1-ylmethyl)-1-(piperidin-4-yl)-1H-py...)
Show SMILES Nc1ncnc2n(nc(Cc3cccc4ccccc34)c12)C1CCNCC1
Show InChI InChI=1S/C21H22N6/c22-20-19-18(12-15-6-3-5-14-4-1-2-7-17(14)15)26-27(21(19)25-13-24-20)16-8-10-23-11-9-16/h1-7,13,16,23H,8-12H2,(H2,22,24,25)
US Patent
n/an/a 59n/an/an/an/an/an/a
University of Washington Through its Center for Commercialization
US Patent
Assay Description
Most known kinase inhibitors bind in the ATP-binding pocket of the active site19,20. These inhibitors exploit many of the same hydrophobic contacts a...
US Patent US9765037 (2017)
BindingDB Entry DOI: 10.7270/Q2B56MVC
Calcium-dependent protein kinase 1 (CDPK1)
(Cryptosporidium parvum)
BDBM50345711
(3-(naphthalen-1-ylmethyl)-1-(piperidin-4-yl)-1H-py...)
Show SMILES Nc1ncnc2n(nc(Cc3cccc4ccccc34)c12)C1CCNCC1
Show InChI InChI=1S/C21H22N6/c22-20-19-18(12-15-6-3-5-14-4-1-2-7-17(14)15)26-27(21(19)25-13-24-20)16-8-10-23-11-9-16/h1-7,13,16,23H,8-12H2,(H2,22,24,25)
US Patent
n/an/a 56n/an/an/an/an/an/a
University of Washington Through its Center for Commercialization
US Patent
Assay Description
Two types of enzyme assays were developed to follow TgCDPK1 activity, a radiometric scintillation proximity assay measured the labeled γ-phospha...
US Patent US9765037 (2017)
BindingDB Entry DOI: 10.7270/Q2B56MVC
Calmodulin-domain protein kinase 1, putative
(Cryptosporidium parvum (strain Iowa II))
BDBM50345711
(3-(naphthalen-1-ylmethyl)-1-(piperidin-4-yl)-1H-py...)
Show SMILES Nc1ncnc2n(nc(Cc3cccc4ccccc34)c12)C1CCNCC1
Show InChI InChI=1S/C21H22N6/c22-20-19-18(12-15-6-3-5-14-4-1-2-7-17(14)15)26-27(21(19)25-13-24-20)16-8-10-23-11-9-16/h1-7,13,16,23H,8-12H2,(H2,22,24,25)
US Patent
n/an/a 56n/an/an/an/an/an/a
UNIVERSITY OF WASHINGTON THROUGH ITS CENTER FOR CO
US Patent
Assay Description
Inhibition of TgCDPK1 and CpCDPK1 was determined using a luminescent kinase assay which measures ATP depletion in the presence of the Syntide 2 pepti...
US Patent US10544104 (2020)
BindingDB Entry DOI: 10.7270/Q2D79DSF
Calmodulin-domain protein kinase 1
(Toxoplasma gondii)
BDBM50345711
(3-(naphthalen-1-ylmethyl)-1-(piperidin-4-yl)-1H-py...)
Show SMILES Nc1ncnc2n(nc(Cc3cccc4ccccc34)c12)C1CCNCC1
Show InChI InChI=1S/C21H22N6/c22-20-19-18(12-15-6-3-5-14-4-1-2-7-17(14)15)26-27(21(19)25-13-24-20)16-8-10-23-11-9-16/h1-7,13,16,23H,8-12H2,(H2,22,24,25)
US Patent
n/an/a 59n/an/an/an/an/an/a
UNIVERSITY OF WASHINGTON THROUGH ITS CENTER FOR CO
US Patent
Assay Description
Inhibition of TgCDPK1 and CpCDPK1 was determined using a luminescent kinase assay which measures ATP depletion in the presence of the Syntide 2 pepti...
US Patent US10544104 (2020)
BindingDB Entry DOI: 10.7270/Q2D79DSF
Calmodulin-domain protein kinase 1
(Toxoplasma gondii)
BDBM50345711
(3-(naphthalen-1-ylmethyl)-1-(piperidin-4-yl)-1H-py...)
Show SMILES Nc1ncnc2n(nc(Cc3cccc4ccccc34)c12)C1CCNCC1
Show InChI InChI=1S/C21H22N6/c22-20-19-18(12-15-6-3-5-14-4-1-2-7-17(14)15)26-27(21(19)25-13-24-20)16-8-10-23-11-9-16/h1-7,13,16,23H,8-12H2,(H2,22,24,25)
US Patent
n/an/a 59n/an/an/an/an/an/a
UNIVERSITY OF WASHINGTON THROUGH ITS CENTER FOR CO
US Patent
Assay Description
Inhibition of TgCDPK1 and CpCDPK1 was determined using a luminescent kinase assay which measures ATP depletion in the presence of the Syntide 2 pepti...
US Patent US10544104 (2020)
BindingDB Entry DOI: 10.7270/Q2D79DSF
Calmodulin-domain protein kinase 1, putative
(Cryptosporidium parvum (strain Iowa II))
BDBM50345711
(3-(naphthalen-1-ylmethyl)-1-(piperidin-4-yl)-1H-py...)
Show SMILES Nc1ncnc2n(nc(Cc3cccc4ccccc34)c12)C1CCNCC1
Show InChI InChI=1S/C21H22N6/c22-20-19-18(12-15-6-3-5-14-4-1-2-7-17(14)15)26-27(21(19)25-13-24-20)16-8-10-23-11-9-16/h1-7,13,16,23H,8-12H2,(H2,22,24,25)
US Patent
n/an/a 56n/an/an/an/an/an/a
UNIVERSITY OF WASHINGTON THROUGH ITS CENTER FOR CO
US Patent
Assay Description
Inhibition of TgCDPK1 and CpCDPK1 was determined using a luminescent kinase assay which measures ATP depletion in the presence of the Syntide 2 pepti...
US Patent US10544104 (2020)
BindingDB Entry DOI: 10.7270/Q2D79DSF