BDBM50353903 CHEMBL1829961
SMILES: Nc1nc(Cl)ncc1-c1c[nH]c2cccc(O)c12
InChI Key: InChIKey=KCSUXNDYSCZCHV-UHFFFAOYSA-N
Data: 2 KI  7 IC50
Activity Spreadsheet -- Enzyme Inhibition Constant Data from BindingDB
Found 9 hits for monomerid = 50353903
Trg + Lig
Ki
nM
ΔG°
kcal/mole
IC50
nM
Kd
nM
EC50/IC50
nM
koff
s-1
kon
M-1s-1
pHTemp
°C
Muscarinic acetylcholine receptor M5
(Homo sapiens (Human))
BDBM50353903
(CHEMBL1829961)
Show SMILES Nc1nc(Cl)ncc1-c1c[nH]c2cccc(O)c12
Show InChI InChI=1S/C12H9ClN4O/c13-12-16-5-7(11(14)17-12)6-4-15-8-2-1-3-9(18)10(6)8/h1-5,15,18H,(H2,14,16,17)
Reactome pathway
7.04E+3n/an/an/an/an/an/an/an/a
University of South Florida
Curated by ChEMBL
Assay Description
Displacement of [3H]QNB from muscarinic acetylcholine M5 receptor after 1.5 hrs by scintillation counting
Bioorg Med Chem 19: 5756-62 (2011)
Article DOI: 10.1016/j.bmc.2011.08.033
BindingDB Entry DOI: 10.7270/Q25X29BF
D(1B) dopamine receptor
(Homo sapiens (Human))
BDBM50353903
(CHEMBL1829961)
Show SMILES Nc1nc(Cl)ncc1-c1c[nH]c2cccc(O)c12
Show InChI InChI=1S/C12H9ClN4O/c13-12-16-5-7(11(14)17-12)6-4-15-8-2-1-3-9(18)10(6)8/h1-5,15,18H,(H2,14,16,17)
>1.00E+4n/an/an/an/an/an/an/an/a
University of South Florida
Curated by ChEMBL
Assay Description
Displacement of [3H]SCH233930 from dopamine D5 receptor after 1.5 hrs by scintillation counting
Bioorg Med Chem 19: 5756-62 (2011)
Article DOI: 10.1016/j.bmc.2011.08.033
BindingDB Entry DOI: 10.7270/Q25X29BF
5-hydroxytryptamine receptor 2C
(Homo sapiens (Human))
BDBM50353903
(CHEMBL1829961)
Show SMILES Nc1nc(Cl)ncc1-c1c[nH]c2cccc(O)c12
Show InChI InChI=1S/C12H9ClN4O/c13-12-16-5-7(11(14)17-12)6-4-15-8-2-1-3-9(18)10(6)8/h1-5,15,18H,(H2,14,16,17)
Reactome pathway
n/an/a>1.00E+4n/an/an/an/an/an/a
University of South Florida
Curated by ChEMBL
Assay Description
Displacement of [3H]mesulergine from 5-HT2C receptor after 1.5 hrs by scintillation counting
Bioorg Med Chem 19: 5756-62 (2011)
Article DOI: 10.1016/j.bmc.2011.08.033
BindingDB Entry DOI: 10.7270/Q25X29BF
5-hydroxytryptamine receptor 5A
(Homo sapiens (Human))
BDBM50353903
(CHEMBL1829961)
Show SMILES Nc1nc(Cl)ncc1-c1c[nH]c2cccc(O)c12
Show InChI InChI=1S/C12H9ClN4O/c13-12-16-5-7(11(14)17-12)6-4-15-8-2-1-3-9(18)10(6)8/h1-5,15,18H,(H2,14,16,17)
n/an/a>1.00E+4n/an/an/an/an/an/a
University of South Florida
Curated by ChEMBL
Assay Description
Displacement of [3H]LSD from 5-HT5A receptor after 1.5 hrs by scintillation counting
Bioorg Med Chem 19: 5756-62 (2011)
Article DOI: 10.1016/j.bmc.2011.08.033
BindingDB Entry DOI: 10.7270/Q25X29BF
5-hydroxytryptamine receptor 1A
(Homo sapiens (Human))
BDBM50353903
(CHEMBL1829961)
Show SMILES Nc1nc(Cl)ncc1-c1c[nH]c2cccc(O)c12
Show InChI InChI=1S/C12H9ClN4O/c13-12-16-5-7(11(14)17-12)6-4-15-8-2-1-3-9(18)10(6)8/h1-5,15,18H,(H2,14,16,17)
n/an/a>1.00E+4n/an/an/an/an/an/a
University of South Florida
Curated by ChEMBL
Assay Description
Displacement of [3H]8-OH-DPAT from 5-HT1A receptor after 1.5 hrs by scintillation counting
Bioorg Med Chem 19: 5756-62 (2011)
Article DOI: 10.1016/j.bmc.2011.08.033
BindingDB Entry DOI: 10.7270/Q25X29BF
Sodium-dependent dopamine transporter
(Homo sapiens (Human))
BDBM50353903
(CHEMBL1829961)
Show SMILES Nc1nc(Cl)ncc1-c1c[nH]c2cccc(O)c12
Show InChI InChI=1S/C12H9ClN4O/c13-12-16-5-7(11(14)17-12)6-4-15-8-2-1-3-9(18)10(6)8/h1-5,15,18H,(H2,14,16,17)
NCI pathway
Reactome pathway
n/an/a>1.00E+4n/an/an/an/an/an/a
University of South Florida
Curated by ChEMBL
Assay Description
Displacement of [3H]WIN35428 from DAT after 1.5 hrs by scintillation counting
Bioorg Med Chem 19: 5756-62 (2011)
Article DOI: 10.1016/j.bmc.2011.08.033
BindingDB Entry DOI: 10.7270/Q25X29BF
5-hydroxytryptamine receptor 2B
(Homo sapiens (Human))
BDBM50353903
(CHEMBL1829961)
Show SMILES Nc1nc(Cl)ncc1-c1c[nH]c2cccc(O)c12
Show InChI InChI=1S/C12H9ClN4O/c13-12-16-5-7(11(14)17-12)6-4-15-8-2-1-3-9(18)10(6)8/h1-5,15,18H,(H2,14,16,17)
Reactome pathway
n/an/a>1.00E+4n/an/an/an/an/an/a
University of South Florida
Curated by ChEMBL
Assay Description
Displacement of [3H]LSD from 5-HT2B receptor after 1.5 hrs by scintillation counting
Bioorg Med Chem 19: 5756-62 (2011)
Article DOI: 10.1016/j.bmc.2011.08.033
BindingDB Entry DOI: 10.7270/Q25X29BF
5-hydroxytryptamine receptor 1D
(Homo sapiens (Human))
BDBM50353903
(CHEMBL1829961)
Show SMILES Nc1nc(Cl)ncc1-c1c[nH]c2cccc(O)c12
Show InChI InChI=1S/C12H9ClN4O/c13-12-16-5-7(11(14)17-12)6-4-15-8-2-1-3-9(18)10(6)8/h1-5,15,18H,(H2,14,16,17)
Reactome pathway
n/an/a>1.00E+4n/an/an/an/an/an/a
University of South Florida
Curated by ChEMBL
Assay Description
Displacement of [3H]5-carboximidotryptamine from 5-HT1D receptor after 1.5 hrs by scintillation counting
Bioorg Med Chem 19: 5756-62 (2011)
Article DOI: 10.1016/j.bmc.2011.08.033
BindingDB Entry DOI: 10.7270/Q25X29BF
5-hydroxytryptamine receptor 7
(Homo sapiens (Human))
BDBM50353903
(CHEMBL1829961)
Show SMILES Nc1nc(Cl)ncc1-c1c[nH]c2cccc(O)c12
Show InChI InChI=1S/C12H9ClN4O/c13-12-16-5-7(11(14)17-12)6-4-15-8-2-1-3-9(18)10(6)8/h1-5,15,18H,(H2,14,16,17)
Reactome pathway
n/an/a>1.00E+4n/an/an/an/an/an/a
University of South Florida
Curated by ChEMBL
Assay Description
Displacement of [3H]LSD from 5-HT7 receptor after 1.5 hrs by scintillation counting
Bioorg Med Chem 19: 5756-62 (2011)
Article DOI: 10.1016/j.bmc.2011.08.033
BindingDB Entry DOI: 10.7270/Q25X29BF