null
SMILES: [#6]\[#6](-[#6])=[#6]\[#6]-[#6]\[#6](-[#6])=[#6]\[#6]-[#16]-[#6]-[#6@H](-[#7]-[#6](=O)-c1ccccc1-[#8]-c1ccccc1)-[#6](-[#8])=O
InChI Key: InChIKey=OEYNXNQXSVCGFH-UEAVEIDSSA-N
Activity Spreadsheet -- Enzyme Inhibition Constant Data from BindingDB
Found 1 hit for monomerid = 50363192
Trg + Lig
Ki
nM
ΔG°
kcal/mole
IC50
nM
Kd
nM
EC50/IC50
nM
koff
s-1
kon
M-1s-1
pHTemp
°C
Protein-S-isoprenylcysteine O-methyltransferase
(Homo sapiens (Human))
BDBM50363192
(CHEMBL1946594)
Show SMILES [#6]\[#6](-[#6])=[#6]\[#6]-[#6]\[#6](-[#6])=[#6]\[#6]-[#16]-[#6]-[#6@H](-[#7]-[#6](=O)-c1ccccc1-[#8]-c1ccccc1)-[#6](-[#8])=O |r|
Show InChI InChI=1S/C26H31NO4S/c1-19(2)10-9-11-20(3)16-17-32-18-23(26(29)30)27-25(28)22-14-7-8-15-24(22)31-21-12-5-4-6-13-21/h4-8,10,12-16,23H,9,11,17-18H2,1-3H3,(H,27,28)(H,29,30)/b20-16+/t23-/m0/s1
n/an/a 1.49E+5n/an/an/an/an/an/a
Purdue University
Curated by ChEMBL
Assay Description
Inhibition of His-tagged human Icmt membrane protein over-expressed in Saccharomyces cerevisiae 2766 using [14C]-SAM and N-acetyl-S-farnesyl-l-cystei...
Bioorg Med Chem 20: 283-95 (2011)
Article DOI: 10.1016/j.bmc.2011.10.087
BindingDB Entry DOI: 10.7270/Q2QZ2BD2