null
SMILES: FC(F)c1ccc(cn1)-c1ccc2OC3CC[C@@H](CC3)n3cnnc3-c3cccc(NC(=O)c2c1)n3
InChI Key:
Activity Spreadsheet -- Enzyme Inhibition Constant Data from BindingDB
Found 1 hit for monomerid = 503691
Trg + Lig
Ki
nM
ΔG°
kcal/mole
IC50
nM
Kd
nM
EC50/IC50
nM
koff
s-1
kon
M-1s-1
pHTemp
°C
Mitogen-activated protein kinase kinase kinase 5
(Homo sapiens (Human))
BDBM503691
(US11034671, Example 84)
Show SMILES FC(F)c1ccc(cn1)-c1ccc2OC3CC[C@@H](CC3)n3cnnc3-c3cccc(NC(=O)c2c1)n3 |r,wU:17.21,(-9.19,.77,;-7.85,1.54,;-7.85,3.08,;-6.52,.77,;-6.52,-.77,;-5.19,-1.54,;-3.85,-.77,;-3.85,.77,;-5.19,1.54,;-2.52,-1.54,;-2.52,-3.08,;-1.18,-3.85,;.15,-3.08,;1.48,-3.85,;2.82,-3.08,;4.15,-3.85,;5.48,-3.08,;5.48,-1.54,;4.15,-.77,;2.82,-1.54,;6.82,-.77,;8.28,-1.25,;9.19,,;8.28,1.25,;6.82,.77,;5.48,1.54,;5.48,3.08,;4.15,3.85,;2.82,3.08,;2.82,1.54,;1.48,.77,;1.48,-.77,;3.02,-.77,;.15,-1.54,;-1.18,-.77,;4.15,.77,)|
n/an/an/a<100n/an/an/an/an/a
TBA
Citation and Details