BDBM50375667 CHEMBL437612::TX-1918
SMILES: [#6]-c1cc(\[#6]=[#6]-2\[#6](=O)-[#6]=[#6]-[#6]-2=O)cc(-[#6])c1-[#8]
InChI Key: InChIKey=YHWRISYBKMXSGJ-UHFFFAOYSA-N
Data: 4 IC50
Activity Spreadsheet -- Enzyme Inhibition Constant Data from BindingDB
Found 4 hits for monomerid = 50375667
Trg + Lig
Ki
nM
ΔG°
kcal/mole
IC50
nM
Kd
nM
EC50/IC50
nM
koff
s-1
kon
M-1s-1
pHTemp
°C
Eukaryotic elongation factor 2 kinase
(Homo sapiens (Human))
BDBM50375667
(CHEMBL437612 | TX-1918)
Show SMILES [#6]-c1cc(\[#6]=[#6]-2\[#6](=O)-[#6]=[#6]-[#6]-2=O)cc(-[#6])c1-[#8] |c:8|
Show InChI InChI=1S/C14H12O3/c1-8-5-10(6-9(2)14(8)17)7-11-12(15)3-4-13(11)16/h3-7,17H,1-2H3
Reactome pathway
n/an/a 440n/an/an/an/an/an/a
University of Oxford
Curated by ChEMBL
Assay Description
Inhibition of eEF2 kinase
Proc Natl Acad Sci USA 104: 20523-8 (2007)
Checked by Author
Article DOI: 10.1073/pnas.0708800104
BindingDB Entry DOI: 10.7270/Q2DB82RH
Eukaryotic elongation factor 2 kinase
(Homo sapiens (Human))
BDBM50375667
(CHEMBL437612 | TX-1918)
Show SMILES [#6]-c1cc(\[#6]=[#6]-2\[#6](=O)-[#6]=[#6]-[#6]-2=O)cc(-[#6])c1-[#8] |c:8|
Show InChI InChI=1S/C14H12O3/c1-8-5-10(6-9(2)14(8)17)7-11-12(15)3-4-13(11)16/h3-7,17H,1-2H3
Reactome pathway
n/an/a 440n/an/an/an/an/an/a
Sichuan University
Curated by ChEMBL
Assay Description
Inhibition of eEF2K in human A431 cells using eEF2 as substrate preincubated for 30 mins followed by ATP/[gamma-32P]-ATP addition measured after 10 m...
Eur J Med Chem 143: 402-418 (2018)
Article DOI: 10.1016/j.ejmech.2017.11.065
BindingDB Entry DOI: 10.7270/Q28C9ZS6
Epidermal growth factor receptor
(Homo sapiens (Human))
BDBM50375667
(CHEMBL437612 | TX-1918)
Show SMILES [#6]-c1cc(\[#6]=[#6]-2\[#6](=O)-[#6]=[#6]-[#6]-2=O)cc(-[#6])c1-[#8] |c:8|
Show InChI InChI=1S/C14H12O3/c1-8-5-10(6-9(2)14(8)17)7-11-12(15)3-4-13(11)16/h3-7,17H,1-2H3
n/an/a 4.40E+5n/an/an/an/an/an/a
University of Oxford
Curated by ChEMBL
Assay Description
Inhibition of EGFR
Proc Natl Acad Sci USA 104: 20523-8 (2007)
Checked by Author
Article DOI: 10.1073/pnas.0708800104
BindingDB Entry DOI: 10.7270/Q2DB82RH
Proto-oncogene tyrosine-protein kinase Src
(Homo sapiens (Human))
BDBM50375667
(CHEMBL437612 | TX-1918)
Show SMILES [#6]-c1cc(\[#6]=[#6]-2\[#6](=O)-[#6]=[#6]-[#6]-2=O)cc(-[#6])c1-[#8] |c:8|
Show InChI InChI=1S/C14H12O3/c1-8-5-10(6-9(2)14(8)17)7-11-12(15)3-4-13(11)16/h3-7,17H,1-2H3
n/an/a 4.40E+3n/an/an/an/an/an/a
University of Oxford
Curated by ChEMBL
Assay Description
Inhibition of Src
Proc Natl Acad Sci USA 104: 20523-8 (2007)
Checked by Author
Article DOI: 10.1073/pnas.0708800104
BindingDB Entry DOI: 10.7270/Q2DB82RH