null
SMILES: Fc1ccc(cc1)-c1ccncc1C(=O)Nc1ccncc1
InChI Key: InChIKey=WPKTZBKLOXQAHV-UHFFFAOYSA-N
Activity Spreadsheet -- Enzyme Inhibition Constant Data from BindingDB
Found 4 hits for monomerid = 50382701
Trg + Lig
Ki
nM
ΔG°
kcal/mole
IC50
nM
Kd
nM
EC50/IC50
nM
koff
s-1
kon
M-1s-1
pHTemp
°C
Rho-associated protein kinase 1 [1-535]
(Homo sapiens (Human))
BDBM50382701
(CHEMBL2023144 | US9409868, 6)
Show SMILES Fc1ccc(cc1)-c1ccncc1C(=O)Nc1ccncc1
Show InChI InChI=1S/C17H12FN3O/c18-13-3-1-12(2-4-13)15-7-10-20-11-16(15)17(22)21-14-5-8-19-9-6-14/h1-11H,(H,19,21,22)
US Patent
n/an/a>4.00E+6n/an/an/an/a7.525
H. Lee Moffin Cancer Center and Research Institute, Inc.
US Patent
Assay Description
A robust FRET-based, enzyme-coupled assay format, Z-Lyte® Kinase Assay Ser/Thr 13 Peptide Kit (Invitrogen, cat. PV3793), was employed in this stu...
US Patent US9409868 (2016)
BindingDB Entry DOI: 10.7270/Q2X63KT0
Rho-associated protein kinase 2
(Homo sapiens (Human))
BDBM50382701
(CHEMBL2023144 | US9409868, 6)
Show SMILES Fc1ccc(cc1)-c1ccncc1C(=O)Nc1ccncc1
Show InChI InChI=1S/C17H12FN3O/c18-13-3-1-12(2-4-13)15-7-10-20-11-16(15)17(22)21-14-5-8-19-9-6-14/h1-11H,(H,19,21,22)
n/an/a>4.00E+5n/an/an/an/an/an/a
H. Lee Moffitt Cancer Center and Research Institute
Curated by ChEMBL
Assay Description
Inhibition of ROCK2 after 1 hr by FRET-based enzyme-coupled assay
J Med Chem 55: 2474-8 (2012)
Article DOI: 10.1021/jm201289r
BindingDB Entry DOI: 10.7270/Q2MG7QH3
Rho-associated protein kinase 1
(Homo sapiens (Human))
BDBM50382701
(CHEMBL2023144 | US9409868, 6)
Show SMILES Fc1ccc(cc1)-c1ccncc1C(=O)Nc1ccncc1
Show InChI InChI=1S/C17H12FN3O/c18-13-3-1-12(2-4-13)15-7-10-20-11-16(15)17(22)21-14-5-8-19-9-6-14/h1-11H,(H,19,21,22)
NCI pathway
Reactome pathway
n/an/a>4.00E+5n/an/an/an/an/an/a
H. Lee Moffitt Cancer Center and Research Institute
Curated by ChEMBL
Assay Description
Inhibition of human His-puritin-tagged ROCK1 expressed in Sf9 cells after 1 hr by FRET-based enzyme-coupled assay
J Med Chem 55: 2474-8 (2012)
Article DOI: 10.1021/jm201289r
BindingDB Entry DOI: 10.7270/Q2MG7QH3
Rho-associated protein kinase 2 [1-552]
(Homo sapiens (Human))
BDBM50382701
(CHEMBL2023144 | US9409868, 6)
Show SMILES Fc1ccc(cc1)-c1ccncc1C(=O)Nc1ccncc1
Show InChI InChI=1S/C17H12FN3O/c18-13-3-1-12(2-4-13)15-7-10-20-11-16(15)17(22)21-14-5-8-19-9-6-14/h1-11H,(H,19,21,22)
US Patent
n/an/a>4.00E+6n/an/an/an/a7.525
H. Lee Moffin Cancer Center and Research Institute, Inc.
US Patent
Assay Description
A robust FRET-based, enzyme-coupled assay format, Z-Lyte® Kinase Assay Ser/Thr 13 Peptide Kit (Invitrogen, cat. PV3793), was employed in this stu...
US Patent US9409868 (2016)
BindingDB Entry DOI: 10.7270/Q2X63KT0