BDBM50385400 CHEMBL2036571
SMILES: Fc1ccccc1Nc1nnc(o1)C(=O)Nc1ccc(nc1)N1CCOCC1
InChI Key: InChIKey=DNICZDPKEHIHNE-UHFFFAOYSA-N
Data: 1 IC50
Activity Spreadsheet -- Enzyme Inhibition Constant Data from BindingDB
Found 1 hit for monomerid = 50385400
Trg + Lig
Ki
nM
ΔG°
kcal/mole
IC50
nM
Kd
nM
EC50/IC50
nM
koff
s-1
kon
M-1s-1
pHTemp
°C
Diacylglycerol O-acyltransferase 1 (DGAT1)
(Homo sapiens (Human))
BDBM50385400
(CHEMBL2036571)
Show SMILES Fc1ccccc1Nc1nnc(o1)C(=O)Nc1ccc(nc1)N1CCOCC1
Show InChI InChI=1S/C18H17FN6O3/c19-13-3-1-2-4-14(13)22-18-24-23-17(28-18)16(26)21-12-5-6-15(20-11-12)25-7-9-27-10-8-25/h1-6,11H,7-10H2,(H,21,26)(H,22,24)
n/an/a 130n/an/an/an/an/an/a
AstraZeneca
Curated by ChEMBL
Assay Description
Inhibition of human recombinant DGAT1 expressed in baculovirus infected insect sf9 cells using [14C] oleoyl coenzyme A after 30 mins by scintillation...
Bioorg Med Chem Lett 22: 3873-8 (2012)
Article DOI: 10.1016/j.bmcl.2012.04.117
BindingDB Entry DOI: 10.7270/Q2T72JG4