BDBM50385409 CHEMBL2036580
SMILES: Fc1ccccc1Nc1nnc(o1)C(=O)Nc1ccc(cc1)-c1ccccc1
InChI Key: InChIKey=ULHJJYRIVGIWEO-UHFFFAOYSA-N
Data: 1 IC50
Activity Spreadsheet -- Enzyme Inhibition Constant Data from BindingDB
Found 1 hit for monomerid = 50385409
Trg + Lig
Ki
nM
ΔG°
kcal/mole
IC50
nM
Kd
nM
EC50/IC50
nM
koff
s-1
kon
M-1s-1
pHTemp
°C
Diacylglycerol O-acyltransferase 1 (DGAT1)
(Homo sapiens (Human))
BDBM50385409
(CHEMBL2036580)
Show SMILES Fc1ccccc1Nc1nnc(o1)C(=O)Nc1ccc(cc1)-c1ccccc1
Show InChI InChI=1S/C21H15FN4O2/c22-17-8-4-5-9-18(17)24-21-26-25-20(28-21)19(27)23-16-12-10-15(11-13-16)14-6-2-1-3-7-14/h1-13H,(H,23,27)(H,24,26)
n/an/a 120n/an/an/an/an/an/a
AstraZeneca
Curated by ChEMBL
Assay Description
Inhibition of human recombinant DGAT1 expressed in baculovirus infected insect sf9 cells using [14C] oleoyl coenzyme A after 30 mins by scintillation...
Bioorg Med Chem Lett 22: 3873-8 (2012)
Article DOI: 10.1016/j.bmcl.2012.04.117
BindingDB Entry DOI: 10.7270/Q2T72JG4