BDBM50385487 CHEMBL2040577
SMILES: COc1ccc(CNC(=O)c2nc([nH]c(=O)c2O)-c2cnccn2)cc1
InChI Key: InChIKey=NDPSNGLDLUJITM-UHFFFAOYSA-N
Data: 1 KI  1 EC50
Activity Spreadsheet -- Enzyme Inhibition Constant Data from BindingDB
Found 2 hits for monomerid = 50385487
Trg + Lig
Ki
nM
ΔG°
kcal/mole
IC50
nM
Kd
nM
EC50/IC50
nM
koff
s-1
kon
M-1s-1
pHTemp
°C
PA/PB1
(Hepatitis C virus)
BDBM50385487
(CHEMBL2040577)
Show SMILES COc1ccc(CNC(=O)c2nc([nH]c(=O)c2O)-c2cnccn2)cc1
Show InChI InChI=1S/C17H15N5O4/c1-26-11-4-2-10(3-5-11)8-20-16(24)13-14(23)17(25)22-15(21-13)12-9-18-6-7-19-12/h2-7,9,23H,8H2,1H3,(H,20,24)(H,21,22,25)
1.12E+4n/an/an/an/an/an/an/an/a
University of Tennessee Health Science Center
Curated by ChEMBL
Assay Description
Binding affinity to PA N-terminal domain (Competitive)
ACS Chem Biol 7: 526-34 (2012)
Article DOI: 10.1021/cb200439z
BindingDB Entry DOI: 10.7270/Q2JQ121G
PA/PB1
(Hepatitis C virus)
BDBM50385487
(CHEMBL2040577)
Show SMILES COc1ccc(CNC(=O)c2nc([nH]c(=O)c2O)-c2cnccn2)cc1
Show InChI InChI=1S/C17H15N5O4/c1-26-11-4-2-10(3-5-11)8-20-16(24)13-14(23)17(25)22-15(21-13)12-9-18-6-7-19-12/h2-7,9,23H,8H2,1H3,(H,20,24)(H,21,22,25)
n/an/an/an/a 3.53E+4n/an/an/an/a
University of Tennessee Health Science Center
Curated by ChEMBL
Assay Description
Plaque growth inhibition
ACS Chem Biol 7: 526-34 (2012)
Article DOI: 10.1021/cb200439z
BindingDB Entry DOI: 10.7270/Q2JQ121G