BDBM50385505 CHEMBL2040555
SMILES: Cc1cc(C)c(C(=O)CC(=O)C(O)=O)c(C)c1
InChI Key: InChIKey=CWIZBMRCSMTJDS-UHFFFAOYSA-N
Data: 1 KI  1 EC50
Activity Spreadsheet -- Enzyme Inhibition Constant Data from BindingDB
Found 2 hits for monomerid = 50385505
Trg + Lig
Ki
nM
ΔG°
kcal/mole
IC50
nM
Kd
nM
EC50/IC50
nM
koff
s-1
kon
M-1s-1
pHTemp
°C
PA/PB1
(Hepatitis C virus)
BDBM50385505
(CHEMBL2040555)
Show SMILES Cc1cc(C)c(C(=O)CC(=O)C(O)=O)c(C)c1
Show InChI InChI=1S/C13H14O4/c1-7-4-8(2)12(9(3)5-7)10(14)6-11(15)13(16)17/h4-5H,6H2,1-3H3,(H,16,17)
2.44E+3n/an/an/an/an/an/an/an/a
University of Tennessee Health Science Center
Curated by ChEMBL
Assay Description
Binding affinity to PA N-terminal domain (Competitive)
ACS Chem Biol 7: 526-34 (2012)
Article DOI: 10.1021/cb200439z
BindingDB Entry DOI: 10.7270/Q2JQ121G
PA/PB1
(Hepatitis C virus)
BDBM50385505
(CHEMBL2040555)
Show SMILES Cc1cc(C)c(C(=O)CC(=O)C(O)=O)c(C)c1
Show InChI InChI=1S/C13H14O4/c1-7-4-8(2)12(9(3)5-7)10(14)6-11(15)13(16)17/h4-5H,6H2,1-3H3,(H,16,17)
n/an/an/an/a 8.17E+3n/an/an/an/a
University of Tennessee Health Science Center
Curated by ChEMBL
Assay Description
Plaque growth inhibition
ACS Chem Biol 7: 526-34 (2012)
Article DOI: 10.1021/cb200439z
BindingDB Entry DOI: 10.7270/Q2JQ121G