BDBM50386178 CHEMBL1800346::ONO-1714
SMILES: C[C@H]1CC(N)=N[C@@H]2[C@H](Cl)[C@H]12
InChI Key: InChIKey=SEVICIFJHBFRBO-OXVRIYFGSA-N
Data: 4 KI  1 IC50
Activity Spreadsheet -- Enzyme Inhibition Constant Data from BindingDB
Found 5 hits for monomerid = 50386178
Trg + Lig
Ki
nM
ΔG°
kcal/mole
IC50
nM
Kd
nM
EC50/IC50
nM
koff
s-1
kon
M-1s-1
pHTemp
°C
Nitric oxide synthase, inducible
(Homo sapiens (Human))
BDBM50386178
(CHEMBL1800346 | ONO-1714)
Show SMILES C[C@H]1CC(N)=N[C@@H]2[C@H](Cl)[C@H]12 |r,c:4|
Show InChI InChI=1S/C7H11ClN2/c1-3-2-4(9)10-7-5(3)6(7)8/h3,5-7H,2H2,1H3,(H2,9,10)/t3-,5?,6+,7-/m0/s1
NCI pathway
Reactome pathway
1.80n/an/an/an/an/an/an/an/a
Instituto Cajal (CSIC)
Curated by ChEMBL
Assay Description
Inhibition of human iNOS
Eur J Med Chem 54: 439-46 (2012)
Article DOI: 10.1016/j.ejmech.2012.05.031
BindingDB Entry DOI: 10.7270/Q2NC6280
Nitric oxide synthase, inducible
(Rattus norvegicus)
BDBM50386178
(CHEMBL1800346 | ONO-1714)
Show SMILES C[C@H]1CC(N)=N[C@@H]2[C@H](Cl)[C@H]12 |r,c:4|
Show InChI InChI=1S/C7H11ClN2/c1-3-2-4(9)10-7-5(3)6(7)8/h3,5-7H,2H2,1H3,(H2,9,10)/t3-,5?,6+,7-/m0/s1
1.80n/an/an/an/an/an/an/an/a
Instituto Cajal (CSIC)
Curated by ChEMBL
Assay Description
Inhibition of rat iNOS
Eur J Med Chem 54: 439-46 (2012)
Article DOI: 10.1016/j.ejmech.2012.05.031
BindingDB Entry DOI: 10.7270/Q2NC6280
Nitric oxide synthase, inducible
(Homo sapiens (Human))
BDBM50386178
(CHEMBL1800346 | ONO-1714)
Show SMILES C[C@H]1CC(N)=N[C@@H]2[C@H](Cl)[C@H]12 |r,c:4|
Show InChI InChI=1S/C7H11ClN2/c1-3-2-4(9)10-7-5(3)6(7)8/h3,5-7H,2H2,1H3,(H2,9,10)/t3-,5?,6+,7-/m0/s1
NCI pathway
Reactome pathway
1.86n/an/an/an/an/an/an/an/a
Nycomed GmbH
Curated by ChEMBL
Assay Description
Inhibition of human iNOS assessed as inhibition of [3H]L-arginine to [3H]L-citrulline conversion by scintillation counting
Bioorg Med Chem Lett 21: 4228-32 (2011)
Article DOI: 10.1016/j.bmcl.2011.05.073
BindingDB Entry DOI: 10.7270/Q2H996GJ
Nitric oxide synthase, endothelial
(Homo sapiens (Human))
BDBM50386178
(CHEMBL1800346 | ONO-1714)
Show SMILES C[C@H]1CC(N)=N[C@@H]2[C@H](Cl)[C@H]12 |r,c:4|
Show InChI InChI=1S/C7H11ClN2/c1-3-2-4(9)10-7-5(3)6(7)8/h3,5-7H,2H2,1H3,(H2,9,10)/t3-,5?,6+,7-/m0/s1
18.6n/an/an/an/an/an/an/an/a
Nycomed GmbH
Curated by ChEMBL
Assay Description
Inhibition of human eNOS assessed as inhibition of [3H]L-arginine to [3H]L-citrulline conversion by scintillation counting
Bioorg Med Chem Lett 21: 4228-32 (2011)
Article DOI: 10.1016/j.bmcl.2011.05.073
BindingDB Entry DOI: 10.7270/Q2H996GJ
Nitric Oxide Synthase, inducible
(Mus musculus (mouse))
BDBM50386178
(CHEMBL1800346 | ONO-1714)
Show SMILES C[C@H]1CC(N)=N[C@@H]2[C@H](Cl)[C@H]12 |r,c:4|
Show InChI InChI=1S/C7H11ClN2/c1-3-2-4(9)10-7-5(3)6(7)8/h3,5-7H,2H2,1H3,(H2,9,10)/t3-,5?,6+,7-/m0/s1
Reactome pathway
n/an/a 11n/an/an/an/an/an/a
Instituto Cajal (CSIC)
Curated by ChEMBL
Assay Description
Inhibition of mouse recombinant iNOS activity assessed as conversion of [14C]-L-arginine to [14C]-L-citrulline by liquid scintillation counting
Eur J Med Chem 54: 439-46 (2012)
Article DOI: 10.1016/j.ejmech.2012.05.031
BindingDB Entry DOI: 10.7270/Q2NC6280