BDBM50393560 CHEMBL2158300::US8697716, 48
SMILES: CC(C)(N)CC(=O)N1CCC(CC1)c1ccc(NC(=O)c2ncc([nH]2)C#N)c(c1)C1=CCCCC1
InChI Key: InChIKey=DEPRXLRJLFPMSV-UHFFFAOYSA-N
Data: 3 IC50
Activity Spreadsheet -- Enzyme Inhibition Constant Data from BindingDB
Found 3 hits for monomerid = 50393560
Trg + Lig
Ki
nM
ΔG°
kcal/mole
IC50
nM
Kd
nM
EC50/IC50
nM
koff
s-1
kon
M-1s-1
pHTemp
°C
Macrophage colony stimulating factor receptor
(Homo sapiens (Human))
BDBM50393560
(CHEMBL2158300 | US8697716, 48)
Show SMILES CC(C)(N)CC(=O)N1CCC(CC1)c1ccc(NC(=O)c2ncc([nH]2)C#N)c(c1)C1=CCCCC1 |t:32|
Show InChI InChI=1S/C27H34N6O2/c1-27(2,29)15-24(34)33-12-10-18(11-13-33)20-8-9-23(22(14-20)19-6-4-3-5-7-19)32-26(35)25-30-17-21(16-28)31-25/h6,8-9,14,17-18H,3-5,7,10-13,15,29H2,1-2H3,(H,30,31)(H,32,35)
n/an/a 0.620n/an/an/an/an/an/a
Johnson& Johnson Pharmaceutical Research& Development
Curated by ChEMBL
Assay Description
Inhibition of FMS mediated phosphorylation using SYEGNSYTFIDPTQ as substrate after 80 mins by fluorescence polarization
J Med Chem 54: 7860-83 (2011)
Article DOI: 10.1021/jm200900q
BindingDB Entry DOI: 10.7270/Q2VD70JB
Mast/stem cell growth factor receptor Kit
(Homo sapiens (Human))
BDBM50393560
(CHEMBL2158300 | US8697716, 48)
Show SMILES CC(C)(N)CC(=O)N1CCC(CC1)c1ccc(NC(=O)c2ncc([nH]2)C#N)c(c1)C1=CCCCC1 |t:32|
Show InChI InChI=1S/C27H34N6O2/c1-27(2,29)15-24(34)33-12-10-18(11-13-33)20-8-9-23(22(14-20)19-6-4-3-5-7-19)32-26(35)25-30-17-21(16-28)31-25/h6,8-9,14,17-18H,3-5,7,10-13,15,29H2,1-2H3,(H,30,31)(H,32,35)
US Patent
n/an/a 5n/an/an/an/an/an/a
Janssen Pharmaceutica NV
US Patent
Assay Description
The compounds of the present invention are also specific inhibitors of c-Kit. Selection of preferred compounds of Formula I for use as c-Kit inhibito...
US Patent US8697716 (2014)
BindingDB Entry DOI: 10.7270/Q2SN07NQ
Macrophage colony-stimulating factor 1 receptor (c-Fms)
(Mus musculus (Mouse))
BDBM50393560
(CHEMBL2158300 | US8697716, 48)
Show SMILES CC(C)(N)CC(=O)N1CCC(CC1)c1ccc(NC(=O)c2ncc([nH]2)C#N)c(c1)C1=CCCCC1 |t:32|
Show InChI InChI=1S/C27H34N6O2/c1-27(2,29)15-24(34)33-12-10-18(11-13-33)20-8-9-23(22(14-20)19-6-4-3-5-7-19)32-26(35)25-30-17-21(16-28)31-25/h6,8-9,14,17-18H,3-5,7,10-13,15,29H2,1-2H3,(H,30,31)(H,32,35)
n/an/a 22n/an/an/an/an/an/a
Johnson& Johnson Pharmaceutical Research& Development
Curated by ChEMBL
Assay Description
Inhibition of FMS-mediated proliferation in CSF1-stimulated bone marrow-derived mouse macrophages assessed as inhibition of incorporation of bromodeo...
J Med Chem 54: 7860-83 (2011)
Article DOI: 10.1021/jm200900q
BindingDB Entry DOI: 10.7270/Q2VD70JB