BDBM50398338 CHEMBL1628706
SMILES: CC(C)(O)CC[C@H](C[C@H](O)[C@H](Cc1cccc(F)c1)NC(=O)c1cnc2ccccc2n1)C(N)=O
InChI Key: InChIKey=YEQJVHQCUDMXFG-FHZYATBESA-N
Data: 3 KI  2 IC50
Activity Spreadsheet -- Enzyme Inhibition Constant Data from BindingDB
Found 5 hits for monomerid = 50398338
Trg + Lig
Ki
nM
ΔG°
kcal/mole
IC50
nM
Kd
nM
EC50/IC50
nM
koff
s-1
kon
M-1s-1
pHTemp
°C
C-C chemokine receptor type 5
(Homo sapiens (Human))
BDBM50398338
(CHEMBL1628706)
Show SMILES CC(C)(O)CC[C@H](C[C@H](O)[C@H](Cc1cccc(F)c1)NC(=O)c1cnc2ccccc2n1)C(N)=O |r|
Show InChI InChI=1S/C26H31FN4O4/c1-26(2,35)11-10-17(24(28)33)14-23(32)21(13-16-6-5-7-18(27)12-16)31-25(34)22-15-29-19-8-3-4-9-20(19)30-22/h3-9,12,15,17,21,23,32,35H,10-11,13-14H2,1-2H3,(H2,28,33)(H,31,34)/t17-,21+,23+/m1/s1
66n/an/an/an/an/an/an/an/a
National Heart and Lung Institute
Curated by ChEMBL
Assay Description
Binding affinity to CCR5
J Med Chem 55: 9363-92 (2012)
Article DOI: 10.1021/jm300682j
BindingDB Entry DOI: 10.7270/Q2862HKR
C-C chemokine receptor type 1
(Homo sapiens (Human))
BDBM50398338
(CHEMBL1628706)
Show SMILES CC(C)(O)CC[C@H](C[C@H](O)[C@H](Cc1cccc(F)c1)NC(=O)c1cnc2ccccc2n1)C(N)=O |r|
Show InChI InChI=1S/C26H31FN4O4/c1-26(2,35)11-10-17(24(28)33)14-23(32)21(13-16-6-5-7-18(27)12-16)31-25(34)22-15-29-19-8-3-4-9-20(19)30-22/h3-9,12,15,17,21,23,32,35H,10-11,13-14H2,1-2H3,(H2,28,33)(H,31,34)/t17-,21+,23+/m1/s1
Reactome pathway
74n/an/an/an/an/an/an/an/a
National Heart and Lung Institute
Curated by ChEMBL
Assay Description
Binding affinity to CCR1
J Med Chem 55: 9363-92 (2012)
Article DOI: 10.1021/jm300682j
BindingDB Entry DOI: 10.7270/Q2862HKR
Muscarinic acetylcholine receptor M2
(Homo sapiens (Human))
BDBM50398338
(CHEMBL1628706)
Show SMILES CC(C)(O)CC[C@H](C[C@H](O)[C@H](Cc1cccc(F)c1)NC(=O)c1cnc2ccccc2n1)C(N)=O |r|
Show InChI InChI=1S/C26H31FN4O4/c1-26(2,35)11-10-17(24(28)33)14-23(32)21(13-16-6-5-7-18(27)12-16)31-25(34)22-15-29-19-8-3-4-9-20(19)30-22/h3-9,12,15,17,21,23,32,35H,10-11,13-14H2,1-2H3,(H2,28,33)(H,31,34)/t17-,21+,23+/m1/s1
1.32E+3n/an/an/an/an/an/an/an/a
National Heart and Lung Institute
Curated by ChEMBL
Assay Description
Binding affinity to muscarinic M2 receptor
J Med Chem 55: 9363-92 (2012)
Article DOI: 10.1021/jm300682j
BindingDB Entry DOI: 10.7270/Q2862HKR
C-C chemokine receptor type 1
(Homo sapiens (Human))
BDBM50398338
(CHEMBL1628706)
Show SMILES CC(C)(O)CC[C@H](C[C@H](O)[C@H](Cc1cccc(F)c1)NC(=O)c1cnc2ccccc2n1)C(N)=O |r|
Show InChI InChI=1S/C26H31FN4O4/c1-26(2,35)11-10-17(24(28)33)14-23(32)21(13-16-6-5-7-18(27)12-16)31-25(34)22-15-29-19-8-3-4-9-20(19)30-22/h3-9,12,15,17,21,23,32,35H,10-11,13-14H2,1-2H3,(H2,28,33)(H,31,34)/t17-,21+,23+/m1/s1
Reactome pathway
n/an/a 39n/an/an/an/an/an/a
Boehringer Ingelheim Pharmaceuticals
Curated by ChEMBL
Assay Description
Antagonist activity at CCR1 in human THP1 cells assessed as inhibition of chemotaxis after 30 mins by Celltiter-glo reagent based luminescence assay
Bioorg Med Chem Lett 29: 435-440 (2019)
Article DOI: 10.1016/j.bmcl.2018.11.015
C-C chemokine receptor type 1
(Homo sapiens (Human))
BDBM50398338
(CHEMBL1628706)
Show SMILES CC(C)(O)CC[C@H](C[C@H](O)[C@H](Cc1cccc(F)c1)NC(=O)c1cnc2ccccc2n1)C(N)=O |r|
Show InChI InChI=1S/C26H31FN4O4/c1-26(2,35)11-10-17(24(28)33)14-23(32)21(13-16-6-5-7-18(27)12-16)31-25(34)22-15-29-19-8-3-4-9-20(19)30-22/h3-9,12,15,17,21,23,32,35H,10-11,13-14H2,1-2H3,(H2,28,33)(H,31,34)/t17-,21+,23+/m1/s1
Reactome pathway
n/an/a 59n/an/an/an/an/an/a
Boehringer Ingelheim Pharmaceuticals
Curated by ChEMBL
Assay Description
Antagonist activity at recombinant CCR1 (unknown origin) expressed in non-adherent cells co-expressing Galpha16 assessed as inhibition of MIP-1 alpha...
Bioorg Med Chem Lett 29: 435-440 (2019)
Article DOI: 10.1016/j.bmcl.2018.11.015