BDBM50401766 CHEMBL2207562
SMILES: CCCC[C@H](C#N)n1cc(nn1)[C@@](C)(NC(=O)c1ccsc1)[C@H]1CC[C@H](C)CC1
InChI Key: InChIKey=GEOZVEILQGZHSF-KIQACKJLSA-N
Data: 3 IC50
Activity Spreadsheet -- Enzyme Inhibition Constant Data from BindingDB
Found 3 hits for monomerid = 50401766
Trg + Lig
Ki
nM
ΔG°
kcal/mole
IC50
nM
Kd
nM
EC50/IC50
nM
koff
s-1
kon
M-1s-1
pHTemp
°C
Procathepsin L
(Homo sapiens (Human))
BDBM50401766
(CHEMBL2207562)
Show SMILES CCCC[C@H](C#N)n1cc(nn1)[C@@](C)(NC(=O)c1ccsc1)[C@H]1CC[C@H](C)CC1 |r,wU:12.13,25.27,wD:12.14,22.24,4.6,(20.99,-15.82,;19.45,-15.89,;18.74,-17.26,;17.2,-17.33,;16.49,-18.7,;17.32,-20,;18.15,-21.29,;14.95,-18.77,;14.09,-20.05,;12.62,-19.64,;12.54,-18.1,;13.98,-17.56,;11.41,-20.6,;10.62,-21.92,;10.07,-19.83,;8.74,-20.6,;8.74,-22.14,;7.51,-19.66,;6.04,-20.11,;5.16,-18.84,;6.09,-17.61,;7.55,-18.12,;12.17,-21.92,;11.39,-23.24,;12.14,-24.56,;13.67,-24.57,;14.43,-25.92,;14.44,-23.26,;13.69,-21.93,)|
Show InChI InChI=1S/C22H31N5OS/c1-4-5-6-19(13-23)27-14-20(25-26-27)22(3,18-9-7-16(2)8-10-18)24-21(28)17-11-12-29-15-17/h11-12,14-16,18-19H,4-10H2,1-3H3,(H,24,28)/t16-,18-,19-,22+/m1/s1
Reactome pathway
n/an/a 600n/an/an/an/an/an/a
Boehringer Ingelheim Pharmaceutical
Curated by ChEMBL
Assay Description
Inhibition of cathepsin L using FR-aminoluciferin as substrate preincubated for 15 mins before substrate addition measured after 1 hr by luminescence...
Bioorg Med Chem Lett 22: 7189-93 (2012)
Article DOI: 10.1016/j.bmcl.2012.09.054
BindingDB Entry DOI: 10.7270/Q2R212JH
Cathepsin S
(Homo sapiens (Human))
BDBM50401766
(CHEMBL2207562)
Show SMILES CCCC[C@H](C#N)n1cc(nn1)[C@@](C)(NC(=O)c1ccsc1)[C@H]1CC[C@H](C)CC1 |r,wU:12.13,25.27,wD:12.14,22.24,4.6,(20.99,-15.82,;19.45,-15.89,;18.74,-17.26,;17.2,-17.33,;16.49,-18.7,;17.32,-20,;18.15,-21.29,;14.95,-18.77,;14.09,-20.05,;12.62,-19.64,;12.54,-18.1,;13.98,-17.56,;11.41,-20.6,;10.62,-21.92,;10.07,-19.83,;8.74,-20.6,;8.74,-22.14,;7.51,-19.66,;6.04,-20.11,;5.16,-18.84,;6.09,-17.61,;7.55,-18.12,;12.17,-21.92,;11.39,-23.24,;12.14,-24.56,;13.67,-24.57,;14.43,-25.92,;14.44,-23.26,;13.69,-21.93,)|
Show InChI InChI=1S/C22H31N5OS/c1-4-5-6-19(13-23)27-14-20(25-26-27)22(3,18-9-7-16(2)8-10-18)24-21(28)17-11-12-29-15-17/h11-12,14-16,18-19H,4-10H2,1-3H3,(H,24,28)/t16-,18-,19-,22+/m1/s1
Reactome pathway
n/an/a 24n/an/an/an/an/an/a
Boehringer Ingelheim Pharmaceutical
Curated by ChEMBL
Assay Description
Inhibition of cathepsin S-mediated antigen presentation in B/T hybridoma cells assessed as IL-2 level
Bioorg Med Chem Lett 22: 7189-93 (2012)
Article DOI: 10.1016/j.bmcl.2012.09.054
BindingDB Entry DOI: 10.7270/Q2R212JH
Cathepsin S
(Homo sapiens (Human))
BDBM50401766
(CHEMBL2207562)
Show SMILES CCCC[C@H](C#N)n1cc(nn1)[C@@](C)(NC(=O)c1ccsc1)[C@H]1CC[C@H](C)CC1 |r,wU:12.13,25.27,wD:12.14,22.24,4.6,(20.99,-15.82,;19.45,-15.89,;18.74,-17.26,;17.2,-17.33,;16.49,-18.7,;17.32,-20,;18.15,-21.29,;14.95,-18.77,;14.09,-20.05,;12.62,-19.64,;12.54,-18.1,;13.98,-17.56,;11.41,-20.6,;10.62,-21.92,;10.07,-19.83,;8.74,-20.6,;8.74,-22.14,;7.51,-19.66,;6.04,-20.11,;5.16,-18.84,;6.09,-17.61,;7.55,-18.12,;12.17,-21.92,;11.39,-23.24,;12.14,-24.56,;13.67,-24.57,;14.43,-25.92,;14.44,-23.26,;13.69,-21.93,)|
Show InChI InChI=1S/C22H31N5OS/c1-4-5-6-19(13-23)27-14-20(25-26-27)22(3,18-9-7-16(2)8-10-18)24-21(28)17-11-12-29-15-17/h11-12,14-16,18-19H,4-10H2,1-3H3,(H,24,28)/t16-,18-,19-,22+/m1/s1
Reactome pathway
n/an/a 0.300n/an/an/an/an/an/a
Boehringer Ingelheim Pharmaceutical
Curated by ChEMBL
Assay Description
Inhibition of cathepsin S using FR-aminoluciferin as substrate preincubated for 15 mins before substrate addition measured after 1 hr by luminescence...
Bioorg Med Chem Lett 22: 7189-93 (2012)
Article DOI: 10.1016/j.bmcl.2012.09.054
BindingDB Entry DOI: 10.7270/Q2R212JH