BDBM50405750 CHEMBL166229
SMILES: C(CCCCNCCCCCCNCc1ccco1)CCCNCCCCCCNCc1ccco1
InChI Key: InChIKey=SIPOMVHLUHHZEN-UHFFFAOYSA-N
Data: 2 Kd
Activity Spreadsheet -- Enzyme Inhibition Constant Data from BindingDB
Found 2 hits for monomerid = 50405750
Trg + Lig
Ki
nM
ΔG°
kcal/mole
IC50
nM
Kd
nM
EC50/IC50
nM
koff
s-1
kon
M-1s-1
pHTemp
°C
Muscarinic acetylcholine receptor M2
(Homo sapiens (Human))
BDBM50405750
(CHEMBL166229)
Show SMILES C(CCCCNCCCCCCNCc1ccco1)CCCNCCCCCCNCc1ccco1
Show InChI InChI=1S/C30H54N4O2/c1(3-9-19-31-21-11-5-7-13-23-33-27-29-17-15-25-35-29)2-4-10-20-32-22-12-6-8-14-24-34-28-30-18-16-26-36-30/h15-18,25-26,31-34H,1-14,19-24,27-28H2
n/an/an/a 9.12n/an/an/an/an/a
University of Camerino
Curated by ChEMBL
Assay Description
Antagonist potency against carbachol induced inhibition of electrically stimulated guinea pig atria Muscarinic acetylcholine receptor
J Med Chem 32: 79-84 (1989)
BindingDB Entry DOI: 10.7270/Q2N017RN
Muscarinic acetylcholine receptor
(Cavia porcellus)
BDBM50405750
(CHEMBL166229)
Show SMILES C(CCCCNCCCCCCNCc1ccco1)CCCNCCCCCCNCc1ccco1
Show InChI InChI=1S/C30H54N4O2/c1(3-9-19-31-21-11-5-7-13-23-33-27-29-17-15-25-35-29)2-4-10-20-32-22-12-6-8-14-24-34-28-30-18-16-26-36-30/h15-18,25-26,31-34H,1-14,19-24,27-28H2
Reactome pathway
n/an/an/a 851n/an/an/an/an/a
University of Camerino
Curated by ChEMBL
Assay Description
Antagonist potency against carbachol induced contractions of isolated guinea pig ileum Muscarinic acetylcholine receptor
J Med Chem 32: 79-84 (1989)
BindingDB Entry DOI: 10.7270/Q2N017RN