null
SMILES: COc1cc(Cc2cnc(N)nc2N)cc2C(C)=CC(C)(C)Nc12
InChI Key: InChIKey=QKSPBAJKZHIVAW-UHFFFAOYSA-N
Activity Spreadsheet -- Enzyme Inhibition Constant Data from BindingDB
Found 3 hits for monomerid = 50406006
Trg + Lig
Ki
nM
ΔG°
kcal/mole
IC50
nM
Kd
nM
EC50/IC50
nM
koff
s-1
kon
M-1s-1
pHTemp
°C
Dihydrofolate reductase
(Escherichia coli)
BDBM50406006
(CHEMBL418492)
Show SMILES COc1cc(Cc2cnc(N)nc2N)cc2C(C)=CC(C)(C)Nc12 |c:18|
Show InChI InChI=1S/C18H23N5O/c1-10-8-18(2,3)23-15-13(10)6-11(7-14(15)24-4)5-12-9-21-17(20)22-16(12)19/h6-9,23H,5H2,1-4H3,(H4,19,20,21,22)
NCI pathway
Reactome pathway
0.300n/an/an/an/an/an/an/an/a
Wellcome Research Laboratories
Curated by ChEMBL
Assay Description
Apparent binding affinity against Dihydrofolate reductase in Escherichia coli
J Med Chem 32: 1942-9 (1989)
Checked by Author
BindingDB Entry DOI: 10.7270/Q2G73FX0
Dihydrofolate reductase
(Gallus gallus (Chicken))
BDBM50406006
(CHEMBL418492)
Show SMILES COc1cc(Cc2cnc(N)nc2N)cc2C(C)=CC(C)(C)Nc12 |c:18|
Show InChI InChI=1S/C18H23N5O/c1-10-8-18(2,3)23-15-13(10)6-11(7-14(15)24-4)5-12-9-21-17(20)22-16(12)19/h6-9,23H,5H2,1-4H3,(H4,19,20,21,22)
Reactome pathway
n/an/a 1.30E+3n/an/an/an/an/an/a
Wellcome Research Laboratories
Curated by ChEMBL
Assay Description
Inhibitory activity against Dihydrofolate reductase in chicken
J Med Chem 32: 1942-9 (1989)
Checked by Author
BindingDB Entry DOI: 10.7270/Q2G73FX0
Dihydrofolate reductase
(Rattus norvegicus (rat))
BDBM50406006
(CHEMBL418492)
Show SMILES COc1cc(Cc2cnc(N)nc2N)cc2C(C)=CC(C)(C)Nc12 |c:18|
Show InChI InChI=1S/C18H23N5O/c1-10-8-18(2,3)23-15-13(10)6-11(7-14(15)24-4)5-12-9-21-17(20)22-16(12)19/h6-9,23H,5H2,1-4H3,(H4,19,20,21,22)
Reactome pathway
n/an/a 3.00E+5n/an/an/an/an/an/a
Wellcome Research Laboratories
Curated by ChEMBL
Assay Description
Inhibitory activity against Dihydrofolate reductase in rat liver
J Med Chem 32: 1942-9 (1989)
Checked by Author
BindingDB Entry DOI: 10.7270/Q2G73FX0