BDBM50407495 CHEMBL330868
SMILES: COc1ccc(Sc2cccc3nc(N)nc(N)c23)cc1
InChI Key: InChIKey=PGSPTCACZVPQJX-UHFFFAOYSA-N
Data: 2 IC50
Activity Spreadsheet -- Enzyme Inhibition Constant Data from BindingDB
Found 2 hits for monomerid = 50407495
Trg + Lig
Ki
nM
ΔG°
kcal/mole
IC50
nM
Kd
nM
EC50/IC50
nM
koff
s-1
kon
M-1s-1
pHTemp
°C
Dihydrofolate Reductase (DHFR)
(Candida albicans)
BDBM50407495
(CHEMBL330868)
Show SMILES COc1ccc(Sc2cccc3nc(N)nc(N)c23)cc1
Show InChI InChI=1S/C15H14N4OS/c1-20-9-5-7-10(8-6-9)21-12-4-2-3-11-13(12)14(16)19-15(17)18-11/h2-8H,1H3,(H4,16,17,18,19)
n/an/a 20n/an/an/an/an/an/a
Burroughs Wellcome Company
Curated by ChEMBL
Assay Description
Inhibition of dihydrofolate reductase in Candida albicans (in vitro).
J Med Chem 38: 3608-16 (1995)
BindingDB Entry DOI: 10.7270/Q2V69KS6
Dihydrofolate reductase
(Homo sapiens (Human))
BDBM50407495
(CHEMBL330868)
Show SMILES COc1ccc(Sc2cccc3nc(N)nc(N)c23)cc1
Show InChI InChI=1S/C15H14N4OS/c1-20-9-5-7-10(8-6-9)21-12-4-2-3-11-13(12)14(16)19-15(17)18-11/h2-8H,1H3,(H4,16,17,18,19)
NCI pathway
Reactome pathway
n/an/a 3.50E+3n/an/an/an/an/an/a
Burroughs Wellcome Company
Curated by ChEMBL
Assay Description
In vitro inhibition of human dihydrofolate reductase
J Med Chem 38: 3608-16 (1995)
BindingDB Entry DOI: 10.7270/Q2V69KS6