null
SMILES: CCOC(=O)c1ccc(NC(=O)N[C@H](Cc2ccc(O)cc2)C(=O)N[C@H]2CCN(Cc3ccc(O)cc3)C2)cc1
InChI Key: InChIKey=XKCJLNBEKXPHNT-RPLLCQBOSA-N
Activity Spreadsheet -- Enzyme Inhibition Constant Data from BindingDB
Found 3 hits for monomerid = 50412341
Trg + Lig
Ki
nM
ΔG°
kcal/mole
IC50
nM
Kd
nM
EC50/IC50
nM
koff
s-1
kon
M-1s-1
pHTemp
°C
Muscarinic acetylcholine receptor M3
(Homo sapiens (Human))
BDBM50412341
(CHEMBL505453)
Show SMILES CCOC(=O)c1ccc(NC(=O)N[C@H](Cc2ccc(O)cc2)C(=O)N[C@H]2CCN(Cc3ccc(O)cc3)C2)cc1 |r|
Show InChI InChI=1S/C30H34N4O6/c1-2-40-29(38)22-7-9-23(10-8-22)32-30(39)33-27(17-20-3-11-25(35)12-4-20)28(37)31-24-15-16-34(19-24)18-21-5-13-26(36)14-6-21/h3-14,24,27,35-36H,2,15-19H2,1H3,(H,31,37)(H2,32,33,39)/t24-,27+/m0/s1
Reactome pathway
n/an/a 3.16E+3n/an/an/an/an/an/a
GlaxoSmithKline
Curated by ChEMBL
Assay Description
Antagonist activity at human muscarinic acetylcholine M3 receptor expressed in CHO cells assessed as inhibition of acetylcholine-induced calcium mobi...
J Med Chem 51: 4866-9 (2008)
Article DOI: 10.1021/jm800634k
BindingDB Entry DOI: 10.7270/Q2MG7QQS
Muscarinic acetylcholine receptor M1
(Homo sapiens (Human))
BDBM50412341
(CHEMBL505453)
Show SMILES CCOC(=O)c1ccc(NC(=O)N[C@H](Cc2ccc(O)cc2)C(=O)N[C@H]2CCN(Cc3ccc(O)cc3)C2)cc1 |r|
Show InChI InChI=1S/C30H34N4O6/c1-2-40-29(38)22-7-9-23(10-8-22)32-30(39)33-27(17-20-3-11-25(35)12-4-20)28(37)31-24-15-16-34(19-24)18-21-5-13-26(36)14-6-21/h3-14,24,27,35-36H,2,15-19H2,1H3,(H,31,37)(H2,32,33,39)/t24-,27+/m0/s1
n/an/a 1.26E+4n/an/an/an/an/an/a
GlaxoSmithKline
Curated by ChEMBL
Assay Description
Antagonist activity at human muscarinic acetylcholine M1 receptor expressed in CHO cells assessed as inhibition of acetylcholine-induced calcium mobi...
J Med Chem 51: 4866-9 (2008)
Article DOI: 10.1021/jm800634k
BindingDB Entry DOI: 10.7270/Q2MG7QQS
Muscarinic acetylcholine receptor M2
(Homo sapiens (Human))
BDBM50412341
(CHEMBL505453)
Show SMILES CCOC(=O)c1ccc(NC(=O)N[C@H](Cc2ccc(O)cc2)C(=O)N[C@H]2CCN(Cc3ccc(O)cc3)C2)cc1 |r|
Show InChI InChI=1S/C30H34N4O6/c1-2-40-29(38)22-7-9-23(10-8-22)32-30(39)33-27(17-20-3-11-25(35)12-4-20)28(37)31-24-15-16-34(19-24)18-21-5-13-26(36)14-6-21/h3-14,24,27,35-36H,2,15-19H2,1H3,(H,31,37)(H2,32,33,39)/t24-,27+/m0/s1
n/an/a 5.01E+3n/an/an/an/an/an/a
GlaxoSmithKline
Curated by ChEMBL
Assay Description
Antagonist activity at human muscarinic acetylcholine M2 receptor expressed in CHO cells coexpressed with Gqi5 assessed as inhibition of acetylcholin...
J Med Chem 51: 4866-9 (2008)
Article DOI: 10.1021/jm800634k
BindingDB Entry DOI: 10.7270/Q2MG7QQS