BDBM50417428 CHEMBL1290184
SMILES: Cc1cccc(CN2CCC3(CC2)CCN(CC3)C(=O)c2ccccc2)c1
InChI Key: InChIKey=BOXHESMXGWQKOM-UHFFFAOYSA-N
Data: 2 IC50
Activity Spreadsheet -- Enzyme Inhibition Constant Data from BindingDB
Found 2 hits for monomerid = 50417428
Trg + Lig
Ki
nM
ΔG°
kcal/mole
IC50
nM
Kd
nM
EC50/IC50
nM
koff
s-1
kon
M-1s-1
pHTemp
°C
Muscarinic acetylcholine receptor M2
(Homo sapiens (Human))
BDBM50417428
(CHEMBL1290184)
Show SMILES Cc1cccc(CN2CCC3(CC2)CCN(CC3)C(=O)c2ccccc2)c1
Show InChI InChI=1S/C24H30N2O/c1-20-6-5-7-21(18-20)19-25-14-10-24(11-15-25)12-16-26(17-13-24)23(27)22-8-3-2-4-9-22/h2-9,18H,10-17,19H2,1H3
n/an/a 2.51n/an/an/an/an/an/a
AstraZeneca
Curated by ChEMBL
Assay Description
Displacement of [3H]NMS from human muscarinic M2 receptor expressed in CHO-K1 cells after 16 hrs by scintillation proximity assay
Bioorg Med Chem Lett 20: 7458-61 (2010)
Article DOI: 10.1016/j.bmcl.2010.10.016
BindingDB Entry DOI: 10.7270/Q2GM88K4
Muscarinic acetylcholine receptor M3
(Homo sapiens (Human))
BDBM50417428
(CHEMBL1290184)
Show SMILES Cc1cccc(CN2CCC3(CC2)CCN(CC3)C(=O)c2ccccc2)c1
Show InChI InChI=1S/C24H30N2O/c1-20-6-5-7-21(18-20)19-25-14-10-24(11-15-25)12-16-26(17-13-24)23(27)22-8-3-2-4-9-22/h2-9,18H,10-17,19H2,1H3
Reactome pathway
n/an/a 100n/an/an/an/an/an/a
AstraZeneca
Curated by ChEMBL
Assay Description
Displacement of [3H]NMS from human muscarinic M3 receptor expressed in CHO-K1 cells after 16 hrs by scintillation proximity assay
Bioorg Med Chem Lett 20: 7458-61 (2010)
Article DOI: 10.1016/j.bmcl.2010.10.016
BindingDB Entry DOI: 10.7270/Q2GM88K4