BDBM50428560 CHEMBL2337520
SMILES: [#6]-[#6]\[#6](=[#6](/c1ccc(-[#8]-[#6]-[#6]-[#7]-2-[#6]-[#6]-[#6]-[#6]-2)cc1)-c1ccc(-[#8]-[#6]-[#6]-[#7]-2-[#6]-[#6]-[#6]-[#6]-2)cc1)-c1cccc(-[#8]-[#6](=O)-[#6]-[#6]-[#6]-[#6]-[#6]-[#7]-[#6](=O)-[#6]-[#6]-[#6]-[#6]-[#6@@H]-2-[#16]-[#6]-[#6@@H]-3-[#7]-[#6](=O)-[#7]-[#6@H]-2-3)c1
InChI Key: InChIKey=QXVXZNUPUXSBDS-YYSLAXLZSA-N
Data: 1 Kd
Activity Spreadsheet -- Enzyme Inhibition Constant Data from BindingDB
Found 1 hit for monomerid = 50428560
Trg + Lig
Ki
nM
ΔG°
kcal/mole
IC50
nM
Kd
nM
EC50/IC50
nM
koff
s-1
kon
M-1s-1
pHTemp
°C
GRB10-interacting GYF protein 2
(Homo sapiens (Human))
BDBM50428560
(CHEMBL2337520)
Show SMILES [#6]-[#6]\[#6](=[#6](/c1ccc(-[#8]-[#6]-[#6]-[#7]-2-[#6]-[#6]-[#6]-[#6]-2)cc1)-c1ccc(-[#8]-[#6]-[#6]-[#7]-2-[#6]-[#6]-[#6]-[#6]-2)cc1)-c1cccc(-[#8]-[#6](=O)-[#6]-[#6]-[#6]-[#6]-[#6]-[#7]-[#6](=O)-[#6]-[#6]-[#6]-[#6]-[#6@@H]-2-[#16]-[#6]-[#6@@H]-3-[#7]-[#6](=O)-[#7]-[#6@H]-2-3)c1 |r|
Show InChI InChI=1S/C50H67N5O6S/c1-2-43(39-13-12-14-42(35-39)61-47(57)17-4-3-7-26-51-46(56)16-6-5-15-45-49-44(36-62-45)52-50(58)53-49)48(37-18-22-40(23-19-37)59-33-31-54-27-8-9-28-54)38-20-24-41(25-21-38)60-34-32-55-29-10-11-30-55/h12-14,18-25,35,44-45,49H,2-11,15-17,26-34,36H2,1H3,(H,51,56)(H2,52,53,58)/t44-,45-,49-/m0/s1
n/an/an/a 186n/an/an/an/an/a
Tokyo University of Science
Curated by ChEMBL
Assay Description
Binding affinity to recombinant His-tagged Grb10 interacting GYF protein 2 (745-1030 amino acids) (unknown origin) by surface plasmon resonance analy...
Bioorg Med Chem 21: 311-20 (2012)
Article DOI: 10.1016/j.bmc.2012.10.037
BindingDB Entry DOI: 10.7270/Q2KK9D5C