BDBM50431381 FOSTAMATINIB::R-788 Free acid::R-935788 Free acid
SMILES: COc1cc(Nc2ncc(F)c(Nc3ccc4OC(C)(C)C(=O)N(COP(O)(O)=O)c4n3)n2)cc(OC)c1OC
InChI Key: InChIKey=GKDRMWXFWHEQQT-UHFFFAOYSA-N
Data: 5 IC50
PDB links: 1 PDB ID matches this monomer.
Activity Spreadsheet -- Enzyme Inhibition Constant Data from BindingDB
Found 5 hits for monomerid = 50431381
Trg + Lig
Ki
nM
ΔG°
kcal/mole
IC50
nM
Kd
nM
EC50/IC50
nM
koff
s-1
kon
M-1s-1
pHTemp
°C
Tyrosine-protein kinase SYK
(Homo sapiens (Human))
BDBM50431381
(FOSTAMATINIB | R-788 Free acid | R-935788 Free aci...)
Show SMILES COc1cc(Nc2ncc(F)c(Nc3ccc4OC(C)(C)C(=O)N(COP(O)(O)=O)c4n3)n2)cc(OC)c1OC
Show InChI InChI=1S/C23H26FN6O9P/c1-23(2)21(31)30(11-38-40(32,33)34)20-14(39-23)6-7-17(28-20)27-19-13(24)10-25-22(29-19)26-12-8-15(35-3)18(37-5)16(9-12)36-4/h6-10H,11H2,1-5H3,(H2,32,33,34)(H2,25,26,27,28,29)
NCI pathway
Reactome pathway
n/an/a 17n/an/an/an/an/an/a
Hoffmann-La Roche Inc.
Curated by ChEMBL
Assay Description
Inhibition of human recombinant truncated SYK (360 to 365 amino acid residues) using N-terminally biotinylated EPEGDYEEVLE peptide as substrate asses...
J Med Chem 56: 1677-92 (2013)
Article DOI: 10.1021/jm301720p
BindingDB Entry DOI: 10.7270/Q22N53M0
Potassium voltage-gated channel subfamily H member 2
(Homo sapiens (Human))
BDBM50431381
(FOSTAMATINIB | R-788 Free acid | R-935788 Free aci...)
Show SMILES COc1cc(Nc2ncc(F)c(Nc3ccc4OC(C)(C)C(=O)N(COP(O)(O)=O)c4n3)n2)cc(OC)c1OC
Show InChI InChI=1S/C23H26FN6O9P/c1-23(2)21(31)30(11-38-40(32,33)34)20-14(39-23)6-7-17(28-20)27-19-13(24)10-25-22(29-19)26-12-8-15(35-3)18(37-5)16(9-12)36-4/h6-10H,11H2,1-5H3,(H2,32,33,34)(H2,25,26,27,28,29)
Reactome pathway
n/an/a>1.00E+3n/an/an/an/an/an/a
Hoffmann-La Roche Inc.
Curated by ChEMBL
Assay Description
Inhibition of human ERG channel
J Med Chem 56: 1677-92 (2013)
Article DOI: 10.1021/jm301720p
BindingDB Entry DOI: 10.7270/Q22N53M0
Cytochrome P450 3A4
(Homo sapiens (Human))
BDBM50431381
(FOSTAMATINIB | R-788 Free acid | R-935788 Free aci...)
Show SMILES COc1cc(Nc2ncc(F)c(Nc3ccc4OC(C)(C)C(=O)N(COP(O)(O)=O)c4n3)n2)cc(OC)c1OC
Show InChI InChI=1S/C23H26FN6O9P/c1-23(2)21(31)30(11-38-40(32,33)34)20-14(39-23)6-7-17(28-20)27-19-13(24)10-25-22(29-19)26-12-8-15(35-3)18(37-5)16(9-12)36-4/h6-10H,11H2,1-5H3,(H2,32,33,34)(H2,25,26,27,28,29)
Reactome pathway
n/an/a>5.00E+4n/an/an/an/an/an/a
Hoffmann-La Roche Inc.
Curated by ChEMBL
Assay Description
Inhibition of CYP3A4 (unknown origin)
J Med Chem 56: 1677-92 (2013)
Article DOI: 10.1021/jm301720p
BindingDB Entry DOI: 10.7270/Q22N53M0
Tyrosine-protein kinase SYK
(Homo sapiens (Human))
BDBM50431381
(FOSTAMATINIB | R-788 Free acid | R-935788 Free aci...)
Show SMILES COc1cc(Nc2ncc(F)c(Nc3ccc4OC(C)(C)C(=O)N(COP(O)(O)=O)c4n3)n2)cc(OC)c1OC
Show InChI InChI=1S/C23H26FN6O9P/c1-23(2)21(31)30(11-38-40(32,33)34)20-14(39-23)6-7-17(28-20)27-19-13(24)10-25-22(29-19)26-12-8-15(35-3)18(37-5)16(9-12)36-4/h6-10H,11H2,1-5H3,(H2,32,33,34)(H2,25,26,27,28,29)
NCI pathway
Reactome pathway
n/an/a 1.20E+4n/an/an/an/an/an/a
Hoffmann-La Roche Inc.
Curated by ChEMBL
Assay Description
Inhibition of SYK in human whole blood
J Med Chem 56: 1677-92 (2013)
Article DOI: 10.1021/jm301720p
BindingDB Entry DOI: 10.7270/Q22N53M0
Tyrosine-protein kinase SYK
(Homo sapiens (Human))
BDBM50431381
(FOSTAMATINIB | R-788 Free acid | R-935788 Free aci...)
Show SMILES COc1cc(Nc2ncc(F)c(Nc3ccc4OC(C)(C)C(=O)N(COP(O)(O)=O)c4n3)n2)cc(OC)c1OC
Show InChI InChI=1S/C23H26FN6O9P/c1-23(2)21(31)30(11-38-40(32,33)34)20-14(39-23)6-7-17(28-20)27-19-13(24)10-25-22(29-19)26-12-8-15(35-3)18(37-5)16(9-12)36-4/h6-10H,11H2,1-5H3,(H2,32,33,34)(H2,25,26,27,28,29)
NCI pathway
Reactome pathway
n/an/a 267n/an/an/an/an/an/a
Hoffmann-La Roche Inc.
Curated by ChEMBL
Assay Description
Inhibition of SYK in human Ramos cells
J Med Chem 56: 1677-92 (2013)
Article DOI: 10.1021/jm301720p
BindingDB Entry DOI: 10.7270/Q22N53M0