BDBM50433277 CHEMBL2376313
SMILES: CCC1(C)N(C)C(=O)c2cc(ccc2NC1=O)S(=O)(=O)Nc1ccc(F)cc1F
InChI Key: InChIKey=QBMRCDGDWIRKMZ-UHFFFAOYSA-N
Data: 6 IC50
Activity Spreadsheet -- Enzyme Inhibition Constant Data from BindingDB
Found 6 hits for monomerid = 50433277
Trg + Lig
Ki
nM
ΔG°
kcal/mole
IC50
nM
Kd
nM
EC50/IC50
nM
koff
s-1
kon
M-1s-1
pHTemp
°C
Diacylglycerol O-acyltransferase 1 (DGAT1)
(Homo sapiens (Human))
BDBM50433277
(CHEMBL2376313)
Show SMILES CCC1(C)N(C)C(=O)c2cc(ccc2NC1=O)S(=O)(=O)Nc1ccc(F)cc1F
Show InChI InChI=1S/C19H19F2N3O4S/c1-4-19(2)18(26)22-15-8-6-12(10-13(15)17(25)24(19)3)29(27,28)23-16-7-5-11(20)9-14(16)21/h5-10,23H,4H2,1-3H3,(H,22,26)
n/an/a>1.00E+4n/an/an/an/an/an/a
AstraZeneca
Curated by ChEMBL
Assay Description
Inhibition of human recombinant DGAT1 expressed in Sf9 cells using dioleoyl-sn-glycerol and [14C]oleoyl coenzyme A as substrate after 30 mins by liqu...
Bioorg Med Chem Lett 23: 2721-6 (2013)
Article DOI: 10.1016/j.bmcl.2013.02.084
BindingDB Entry DOI: 10.7270/Q2GB25DM
Alpha-1,6-mannosyl-glycoprotein 2-beta-N-acetylglucosaminyltransferase
(Mus musculus)
BDBM50433277
(CHEMBL2376313)
Show SMILES CCC1(C)N(C)C(=O)c2cc(ccc2NC1=O)S(=O)(=O)Nc1ccc(F)cc1F
Show InChI InChI=1S/C19H19F2N3O4S/c1-4-19(2)18(26)22-15-8-6-12(10-13(15)17(25)24(19)3)29(27,28)23-16-7-5-11(20)9-14(16)21/h5-10,23H,4H2,1-3H3,(H,22,26)
Reactome pathway
n/an/a 631n/an/an/an/an/an/a
AstraZeneca
Curated by ChEMBL
Assay Description
Inhibition of mouse recombinant MGAT2 expressed in insect cell membrane using 2-oleoyl-sn-glycerol and oleoyl coenzyme A as substrate after 40 mins b...
Bioorg Med Chem Lett 23: 2721-6 (2013)
Article DOI: 10.1016/j.bmcl.2013.02.084
BindingDB Entry DOI: 10.7270/Q2GB25DM
Diacylglycerol O-acyltransferase 2
(Homo sapiens (Human))
BDBM50433277
(CHEMBL2376313)
Show SMILES CCC1(C)N(C)C(=O)c2cc(ccc2NC1=O)S(=O)(=O)Nc1ccc(F)cc1F
Show InChI InChI=1S/C19H19F2N3O4S/c1-4-19(2)18(26)22-15-8-6-12(10-13(15)17(25)24(19)3)29(27,28)23-16-7-5-11(20)9-14(16)21/h5-10,23H,4H2,1-3H3,(H,22,26)
Reactome pathway
n/an/a>1.00E+4n/an/an/an/an/an/a
AstraZeneca
Curated by ChEMBL
Assay Description
Inhibition of human recombinant DGAT2 using dioleoyl-sn-glycerol and [14C]oleoyl coenzyme A as substrate after 30 mins by liquid scintillation counti...
Bioorg Med Chem Lett 23: 2721-6 (2013)
Article DOI: 10.1016/j.bmcl.2013.02.084
BindingDB Entry DOI: 10.7270/Q2GB25DM
Acyl-CoA wax alcohol acyltransferase 2
(Homo sapiens (Human))
BDBM50433277
(CHEMBL2376313)
Show SMILES CCC1(C)N(C)C(=O)c2cc(ccc2NC1=O)S(=O)(=O)Nc1ccc(F)cc1F
Show InChI InChI=1S/C19H19F2N3O4S/c1-4-19(2)18(26)22-15-8-6-12(10-13(15)17(25)24(19)3)29(27,28)23-16-7-5-11(20)9-14(16)21/h5-10,23H,4H2,1-3H3,(H,22,26)
n/an/a>1.00E+5n/an/an/an/an/an/a
AstraZeneca
Curated by ChEMBL
Assay Description
Inhibition of human recombinant AWAT2 expressed in insect cell membrane using cetyl alcohol and [14C]oleoyl coenzyme A as substrate after 10 to 15 mi...
Bioorg Med Chem Lett 23: 2721-6 (2013)
Article DOI: 10.1016/j.bmcl.2013.02.084
BindingDB Entry DOI: 10.7270/Q2GB25DM
Acyl-CoA wax alcohol acyltransferase 1
(Homo sapiens (Human))
BDBM50433277
(CHEMBL2376313)
Show SMILES CCC1(C)N(C)C(=O)c2cc(ccc2NC1=O)S(=O)(=O)Nc1ccc(F)cc1F
Show InChI InChI=1S/C19H19F2N3O4S/c1-4-19(2)18(26)22-15-8-6-12(10-13(15)17(25)24(19)3)29(27,28)23-16-7-5-11(20)9-14(16)21/h5-10,23H,4H2,1-3H3,(H,22,26)
n/an/a>1.00E+5n/an/an/an/an/an/a
AstraZeneca
Curated by ChEMBL
Assay Description
Inhibition of human recombinant AWAT1 expressed in insect cell membrane using palmitoleyl alcohol and [14C]stearoyl coenzyme A as substrate after 10 ...
Bioorg Med Chem Lett 23: 2721-6 (2013)
Article DOI: 10.1016/j.bmcl.2013.02.084
BindingDB Entry DOI: 10.7270/Q2GB25DM
Alpha-1,6-mannosyl-glycoprotein 2-beta-N-acetylglucosaminyltransferase
(Homo sapiens (Human))
BDBM50433277
(CHEMBL2376313)
Show SMILES CCC1(C)N(C)C(=O)c2cc(ccc2NC1=O)S(=O)(=O)Nc1ccc(F)cc1F
Show InChI InChI=1S/C19H19F2N3O4S/c1-4-19(2)18(26)22-15-8-6-12(10-13(15)17(25)24(19)3)29(27,28)23-16-7-5-11(20)9-14(16)21/h5-10,23H,4H2,1-3H3,(H,22,26)
n/an/a 7.94E+3n/an/an/an/an/an/a
AstraZeneca
Curated by ChEMBL
Assay Description
Inhibition of human recombinant MGAT2 expressed in insect cell membrane using 2-oleoyl-sn-glycerol and oleoyl coenzyme A as substrate after 40 mins b...
Bioorg Med Chem Lett 23: 2721-6 (2013)
Article DOI: 10.1016/j.bmcl.2013.02.084
BindingDB Entry DOI: 10.7270/Q2GB25DM