BDBM50435960 CHEMBL2391486
SMILES: Cc1cc(=O)oc2cc(OCCN3CCN(CC(=O)Nc4c5CCCCc5nc5ccccc45)CC3)ccc12
InChI Key: InChIKey=RFIJTJVQDQTLEV-UHFFFAOYSA-N
Data: 1 KI  4 IC50
Activity Spreadsheet -- Enzyme Inhibition Constant Data from BindingDB
Found 5 hits for monomerid = 50435960
Trg + Lig
Ki
nM
ΔG°
kcal/mole
IC50
nM
Kd
nM
EC50/IC50
nM
koff
s-1
kon
M-1s-1
pHTemp
°C
Acetylcholinesterase
(Electrophorus electricus (Electric eel))
BDBM50435960
(CHEMBL2391486)
Show SMILES Cc1cc(=O)oc2cc(OCCN3CCN(CC(=O)Nc4c5CCCCc5nc5ccccc45)CC3)ccc12
Show InChI InChI=1S/C31H34N4O4/c1-21-18-30(37)39-28-19-22(10-11-23(21)28)38-17-16-34-12-14-35(15-13-34)20-29(36)33-31-24-6-2-4-8-26(24)32-27-9-5-3-7-25(27)31/h2,4,6,8,10-11,18-19H,3,5,7,9,12-17,20H2,1H3,(H,32,33,36)
81n/an/an/an/an/an/an/an/a
China Pharmaceutical University
Curated by ChEMBL
Assay Description
Competitive inhibition of electric eel AChE using acetylthiocholine as substrate by Lineweaver-Burk plot analysis
Eur J Med Chem 64: 540-53 (2013)
Article DOI: 10.1016/j.ejmech.2013.03.051
BindingDB Entry DOI: 10.7270/Q2H996KW
Cholinesterase
(Equus caballus (Horse))
BDBM50435960
(CHEMBL2391486)
Show SMILES Cc1cc(=O)oc2cc(OCCN3CCN(CC(=O)Nc4c5CCCCc5nc5ccccc45)CC3)ccc12
Show InChI InChI=1S/C31H34N4O4/c1-21-18-30(37)39-28-19-22(10-11-23(21)28)38-17-16-34-12-14-35(15-13-34)20-29(36)33-31-24-6-2-4-8-26(24)32-27-9-5-3-7-25(27)31/h2,4,6,8,10-11,18-19H,3,5,7,9,12-17,20H2,1H3,(H,32,33,36)
n/an/a 234n/an/an/an/an/an/a
China Pharmaceutical University
Curated by ChEMBL
Assay Description
Inhibition of equine serum BChE using S-butyrylthiocholine iodide as substrate preincubated for 6 mins prior to substrate addition measured at 60 to ...
Eur J Med Chem 64: 540-53 (2013)
Article DOI: 10.1016/j.ejmech.2013.03.051
BindingDB Entry DOI: 10.7270/Q2H996KW
Acetylcholinesterase
(Electrophorus electricus (Electric eel))
BDBM50435960
(CHEMBL2391486)
Show SMILES Cc1cc(=O)oc2cc(OCCN3CCN(CC(=O)Nc4c5CCCCc5nc5ccccc45)CC3)ccc12
Show InChI InChI=1S/C31H34N4O4/c1-21-18-30(37)39-28-19-22(10-11-23(21)28)38-17-16-34-12-14-35(15-13-34)20-29(36)33-31-24-6-2-4-8-26(24)32-27-9-5-3-7-25(27)31/h2,4,6,8,10-11,18-19H,3,5,7,9,12-17,20H2,1H3,(H,32,33,36)
n/an/a 9.20E+4n/an/an/an/an/an/a
China Pharmaceutical University
Curated by ChEMBL
Assay Description
Inhibition of electric eel AChE using acetylthiocholine as substrate measured for 3.2 mins by Ellman's method
Eur J Med Chem 176: 228-247 (2019)
Article DOI: 10.1016/j.ejmech.2019.05.020
Acetylcholinesterase
(Homo sapiens (Human))
BDBM50435960
(CHEMBL2391486)
Show SMILES Cc1cc(=O)oc2cc(OCCN3CCN(CC(=O)Nc4c5CCCCc5nc5ccccc45)CC3)ccc12
Show InChI InChI=1S/C31H34N4O4/c1-21-18-30(37)39-28-19-22(10-11-23(21)28)38-17-16-34-12-14-35(15-13-34)20-29(36)33-31-24-6-2-4-8-26(24)32-27-9-5-3-7-25(27)31/h2,4,6,8,10-11,18-19H,3,5,7,9,12-17,20H2,1H3,(H,32,33,36)
NCI pathway
Reactome pathway
n/an/a 92n/an/an/an/an/an/a
Punjabi University
Curated by ChEMBL
Assay Description
Inhibition of AChE (unknown origin)
Bioorg Med Chem 22: 3806-14 (2014)
Article DOI: 10.1016/j.bmc.2014.05.032
BindingDB Entry DOI: 10.7270/Q2RF5WN3
Acetylcholinesterase
(Electrophorus electricus (Electric eel))
BDBM50435960
(CHEMBL2391486)
Show SMILES Cc1cc(=O)oc2cc(OCCN3CCN(CC(=O)Nc4c5CCCCc5nc5ccccc45)CC3)ccc12
Show InChI InChI=1S/C31H34N4O4/c1-21-18-30(37)39-28-19-22(10-11-23(21)28)38-17-16-34-12-14-35(15-13-34)20-29(36)33-31-24-6-2-4-8-26(24)32-27-9-5-3-7-25(27)31/h2,4,6,8,10-11,18-19H,3,5,7,9,12-17,20H2,1H3,(H,32,33,36)
n/an/a 92n/an/an/an/an/an/a
China Pharmaceutical University
Curated by ChEMBL
Assay Description
Inhibition of electric eel AChE using acetylthiocholine iodide as substrate preincubated for 6 mins prior to substrate addition measured at 60 to 180...
Eur J Med Chem 64: 540-53 (2013)
Article DOI: 10.1016/j.ejmech.2013.03.051
BindingDB Entry DOI: 10.7270/Q2H996KW