BDBM50436151 CHEMBL2398212
SMILES: Clc1ccc-2c(c1)C(=O)c1nc(C#N)c(nc-21)C#N
InChI Key: InChIKey=BIGPXXAUSQLTQR-UHFFFAOYSA-N
Data: 3 IC50
Activity Spreadsheet -- Enzyme Inhibition Constant Data from BindingDB
Found 3 hits for monomerid = 50436151
Trg + Lig
Ki
nM
ΔG°
kcal/mole
IC50
nM
Kd
nM
EC50/IC50
nM
koff
s-1
kon
M-1s-1
pHTemp
°C
Ubiquitin carboxyl-terminal hydrolase 7
(Homo sapiens (Human))
BDBM50436151
(CHEMBL2398212)
Show SMILES Clc1ccc-2c(c1)C(=O)c1nc(C#N)c(nc-21)C#N
Show InChI InChI=1S/C13H3ClN4O/c14-6-1-2-7-8(3-6)13(19)12-11(7)17-9(4-15)10(5-16)18-12/h1-3H
n/an/a 420n/an/an/an/an/an/a
Kumamoto University
Curated by ChEMBL
Assay Description
Inhibition of USP7 (unknown origin) using ubiquitin-EKL as substrate
Bioorg Med Chem Lett 23: 3884-6 (2013)
Article DOI: 10.1016/j.bmcl.2013.04.066
BindingDB Entry DOI: 10.7270/Q29P332K
Ubiquitin carboxyl-terminal hydrolase 7
(Homo sapiens (Human))
BDBM50436151
(CHEMBL2398212)
Show SMILES Clc1ccc-2c(c1)C(=O)c1nc(C#N)c(nc-21)C#N
Show InChI InChI=1S/C13H3ClN4O/c14-6-1-2-7-8(3-6)13(19)12-11(7)17-9(4-15)10(5-16)18-12/h1-3H
n/an/a 420n/an/an/an/an/an/a
Progenra, Inc.
Curated by ChEMBL
Assay Description
Inhibition of full length wild-type human N-terminal His-tagged USP7 expressed in baculovirus infected Sf9 cells using Ub-AMC as substrate preincubat...
J Med Chem 61: 422-443 (2018)
Article DOI: 10.1021/acs.jmedchem.7b00498
BindingDB Entry DOI: 10.7270/Q2CR5WVG
Ubiquitin carboxyl-terminal hydrolase 8
(Homo sapiens (Human))
BDBM50436151
(CHEMBL2398212)
Show SMILES Clc1ccc-2c(c1)C(=O)c1nc(C#N)c(nc-21)C#N
Show InChI InChI=1S/C13H3ClN4O/c14-6-1-2-7-8(3-6)13(19)12-11(7)17-9(4-15)10(5-16)18-12/h1-3H
Reactome pathway
n/an/a 96n/an/an/an/an/an/a
Progenra, Inc.
Curated by ChEMBL
Assay Description
Inhibition of human full-length His-tagged USP8 expressed baculovirus infected insect cells using Ub-AMC as substrate by fluorescence spectroscopic a...
J Med Chem 61: 422-443 (2018)
Article DOI: 10.1021/acs.jmedchem.7b00498
BindingDB Entry DOI: 10.7270/Q2CR5WVG