BDBM50444909 CHEMBL3099618
SMILES: [#6]-[#6]\[#6](=[#6](/c1ccc(-[#8]-[#6]-[#6]-[#7]-2-[#6]-[#6]-[#6]-[#6]-[#6]-[#6]-2)cc1)-c1ccc(-[#8]-[#6]-[#6]-[#7]-2-[#6]-[#6]-[#6]-[#6]-[#6]-[#6]-2)cc1)-c1ccccc1
InChI Key: InChIKey=CVNPFNZJSHRZFA-UHFFFAOYSA-N
Data: 2 KI  10 IC50
Activity Spreadsheet -- Enzyme Inhibition Constant Data from BindingDB
Found 12 hits for monomerid = 50444909
Trg + Lig
Ki
nM
ΔG°
kcal/mole
IC50
nM
Kd
nM
EC50/IC50
nM
koff
s-1
kon
M-1s-1
pHTemp
°C
Proteasome component C5
(Homo sapiens (Human))
BDBM50444909
(CHEMBL3099618)
Show SMILES [#6]-[#6]\[#6](=[#6](/c1ccc(-[#8]-[#6]-[#6]-[#7]-2-[#6]-[#6]-[#6]-[#6]-[#6]-[#6]-2)cc1)-c1ccc(-[#8]-[#6]-[#6]-[#7]-2-[#6]-[#6]-[#6]-[#6]-[#6]-[#6]-2)cc1)-c1ccccc1
Show InChI InChI=1S/C38H50N2O2/c1-2-37(32-14-8-7-9-15-32)38(33-16-20-35(21-17-33)41-30-28-39-24-10-3-4-11-25-39)34-18-22-36(23-19-34)42-31-29-40-26-12-5-6-13-27-40/h7-9,14-23H,2-6,10-13,24-31H2,1H3
Reactome pathway
340n/an/an/an/an/an/an/an/a
Institute of Bio-Science and Technology
Curated by ChEMBL
Assay Description
Competitive inhibition of PGPH-like activity of human 20S proteasome beta 1 subunit assessed as hydrolysis of Z-LLE-AMC fluorogenic substrate Linewea...
Eur J Med Chem 71: 290-305 (2014)
Article DOI: 10.1016/j.ejmech.2013.11.009
BindingDB Entry DOI: 10.7270/Q2222W81
20S proteasome chymotrypsin-like
(Homo sapiens (Human))
BDBM50444909
(CHEMBL3099618)
Show SMILES [#6]-[#6]\[#6](=[#6](/c1ccc(-[#8]-[#6]-[#6]-[#7]-2-[#6]-[#6]-[#6]-[#6]-[#6]-[#6]-2)cc1)-c1ccc(-[#8]-[#6]-[#6]-[#7]-2-[#6]-[#6]-[#6]-[#6]-[#6]-[#6]-2)cc1)-c1ccccc1
Show InChI InChI=1S/C38H50N2O2/c1-2-37(32-14-8-7-9-15-32)38(33-16-20-35(21-17-33)41-30-28-39-24-10-3-4-11-25-39)34-18-22-36(23-19-34)42-31-29-40-26-12-5-6-13-27-40/h7-9,14-23H,2-6,10-13,24-31H2,1H3
Reactome pathway
580n/an/an/an/an/an/an/an/a
Institute of Bio-Science and Technology
Curated by ChEMBL
Assay Description
Noncompetitive inhibition of chymotrypsin-like activity of human 20S proteasome beta 5 subunit assessed as hydrolysis of succinyl-LLVY-AMC fluorogeni...
Eur J Med Chem 71: 290-305 (2014)
Article DOI: 10.1016/j.ejmech.2013.11.009
BindingDB Entry DOI: 10.7270/Q2222W81
Proteasome Macropain subunit
(Homo sapiens (Human))
BDBM50444909
(CHEMBL3099618)
Show SMILES [#6]-[#6]\[#6](=[#6](/c1ccc(-[#8]-[#6]-[#6]-[#7]-2-[#6]-[#6]-[#6]-[#6]-[#6]-[#6]-2)cc1)-c1ccc(-[#8]-[#6]-[#6]-[#7]-2-[#6]-[#6]-[#6]-[#6]-[#6]-[#6]-2)cc1)-c1ccccc1
Show InChI InChI=1S/C38H50N2O2/c1-2-37(32-14-8-7-9-15-32)38(33-16-20-35(21-17-33)41-30-28-39-24-10-3-4-11-25-39)34-18-22-36(23-19-34)42-31-29-40-26-12-5-6-13-27-40/h7-9,14-23H,2-6,10-13,24-31H2,1H3
Reactome pathway
n/an/a 340n/an/an/an/an/an/a
Institute of Bio-Science and Technology
Curated by ChEMBL
Assay Description
Inhibition of trypsin-like activity of human 20S proteasome beta 2 subunit assessed as hydrolysis of Boc-LRR-AMC fluorogenic substrate measured for 1...
Eur J Med Chem 71: 290-305 (2014)
Article DOI: 10.1016/j.ejmech.2013.11.009
BindingDB Entry DOI: 10.7270/Q2222W81
Proteasome subunit beta type-1/beta type-5
(Homo sapiens (Human))
BDBM50444909
(CHEMBL3099618)
Show SMILES [#6]-[#6]\[#6](=[#6](/c1ccc(-[#8]-[#6]-[#6]-[#7]-2-[#6]-[#6]-[#6]-[#6]-[#6]-[#6]-2)cc1)-c1ccc(-[#8]-[#6]-[#6]-[#7]-2-[#6]-[#6]-[#6]-[#6]-[#6]-[#6]-2)cc1)-c1ccccc1
Show InChI InChI=1S/C38H50N2O2/c1-2-37(32-14-8-7-9-15-32)38(33-16-20-35(21-17-33)41-30-28-39-24-10-3-4-11-25-39)34-18-22-36(23-19-34)42-31-29-40-26-12-5-6-13-27-40/h7-9,14-23H,2-6,10-13,24-31H2,1H3
Reactome pathway
n/an/a>1.00E+5n/an/an/an/an/an/a
Nagahama Institute of Bio-Science and Technology
Curated by ChEMBL
Assay Description
Inhibition of chymotrypsin-like activity of human 26S proteasome using Suc-LLVY-MCA as substrate measured for 1 hr by fluorescence assay
Eur J Med Chem 146: 636-650 (2018)
Article DOI: 10.1016/j.ejmech.2018.01.045
BindingDB Entry DOI: 10.7270/Q2DF6TV7
Proteasome subunit beta type-1/beta type-5
(Homo sapiens (Human))
BDBM50444909
(CHEMBL3099618)
Show SMILES [#6]-[#6]\[#6](=[#6](/c1ccc(-[#8]-[#6]-[#6]-[#7]-2-[#6]-[#6]-[#6]-[#6]-[#6]-[#6]-2)cc1)-c1ccc(-[#8]-[#6]-[#6]-[#7]-2-[#6]-[#6]-[#6]-[#6]-[#6]-[#6]-2)cc1)-c1ccccc1
Show InChI InChI=1S/C38H50N2O2/c1-2-37(32-14-8-7-9-15-32)38(33-16-20-35(21-17-33)41-30-28-39-24-10-3-4-11-25-39)34-18-22-36(23-19-34)42-31-29-40-26-12-5-6-13-27-40/h7-9,14-23H,2-6,10-13,24-31H2,1H3
Reactome pathway
n/an/a 1.10E+4n/an/an/an/an/an/a
Nagahama Institute of Bio-Science and Technology
Curated by ChEMBL
Assay Description
Inhibition of chymotrypsin-like activity of 26S proteasome in human RPMI8226 cells using Suc-LLVY-MCA as substrate after 24 to 48 hrs by luminescence...
Eur J Med Chem 146: 636-650 (2018)
Article DOI: 10.1016/j.ejmech.2018.01.045
BindingDB Entry DOI: 10.7270/Q2DF6TV7
Proteasome component C5
(Homo sapiens (Human))
BDBM50444909
(CHEMBL3099618)
Show SMILES [#6]-[#6]\[#6](=[#6](/c1ccc(-[#8]-[#6]-[#6]-[#7]-2-[#6]-[#6]-[#6]-[#6]-[#6]-[#6]-2)cc1)-c1ccc(-[#8]-[#6]-[#6]-[#7]-2-[#6]-[#6]-[#6]-[#6]-[#6]-[#6]-2)cc1)-c1ccccc1
Show InChI InChI=1S/C38H50N2O2/c1-2-37(32-14-8-7-9-15-32)38(33-16-20-35(21-17-33)41-30-28-39-24-10-3-4-11-25-39)34-18-22-36(23-19-34)42-31-29-40-26-12-5-6-13-27-40/h7-9,14-23H,2-6,10-13,24-31H2,1H3
Reactome pathway
n/an/a 720n/an/an/an/an/an/a
Nagahama Institute of Bio-Science and Technology
Curated by ChEMBL
Assay Description
Inhibition of PGPH activity of human 20S proteasome using Z-LLE-MCA as substrate measured for 1 hr by fluorescence assay
Eur J Med Chem 146: 636-650 (2018)
Article DOI: 10.1016/j.ejmech.2018.01.045
BindingDB Entry DOI: 10.7270/Q2DF6TV7
Proteasome Macropain subunit
(Homo sapiens (Human))
BDBM50444909
(CHEMBL3099618)
Show SMILES [#6]-[#6]\[#6](=[#6](/c1ccc(-[#8]-[#6]-[#6]-[#7]-2-[#6]-[#6]-[#6]-[#6]-[#6]-[#6]-2)cc1)-c1ccc(-[#8]-[#6]-[#6]-[#7]-2-[#6]-[#6]-[#6]-[#6]-[#6]-[#6]-2)cc1)-c1ccccc1
Show InChI InChI=1S/C38H50N2O2/c1-2-37(32-14-8-7-9-15-32)38(33-16-20-35(21-17-33)41-30-28-39-24-10-3-4-11-25-39)34-18-22-36(23-19-34)42-31-29-40-26-12-5-6-13-27-40/h7-9,14-23H,2-6,10-13,24-31H2,1H3
Reactome pathway
n/an/a>1.00E+5n/an/an/an/an/an/a
Nagahama Institute of Bio-Science and Technology
Curated by ChEMBL
Assay Description
Inhibition of trypsin-like activity of human 20S proteasome using Boc-LRR-MCA as substrate measured for 1 hr by fluorescence assay
Eur J Med Chem 146: 636-650 (2018)
Article DOI: 10.1016/j.ejmech.2018.01.045
BindingDB Entry DOI: 10.7270/Q2DF6TV7
Proteasome subunit beta type-1/beta type-5
(Homo sapiens (Human))
BDBM50444909
(CHEMBL3099618)
Show SMILES [#6]-[#6]\[#6](=[#6](/c1ccc(-[#8]-[#6]-[#6]-[#7]-2-[#6]-[#6]-[#6]-[#6]-[#6]-[#6]-2)cc1)-c1ccc(-[#8]-[#6]-[#6]-[#7]-2-[#6]-[#6]-[#6]-[#6]-[#6]-[#6]-2)cc1)-c1ccccc1
Show InChI InChI=1S/C38H50N2O2/c1-2-37(32-14-8-7-9-15-32)38(33-16-20-35(21-17-33)41-30-28-39-24-10-3-4-11-25-39)34-18-22-36(23-19-34)42-31-29-40-26-12-5-6-13-27-40/h7-9,14-23H,2-6,10-13,24-31H2,1H3
Reactome pathway
n/an/a 1.02E+3n/an/an/an/an/an/a
Nagahama Institute of Bio-Science and Technology
Curated by ChEMBL
Assay Description
Inhibition of chymotrypsin-like activity of human 20S proteasome using Suc-LLVY-MCA as substrate measured for 1 hr by fluorescence assay
Eur J Med Chem 146: 636-650 (2018)
Article DOI: 10.1016/j.ejmech.2018.01.045
BindingDB Entry DOI: 10.7270/Q2DF6TV7
Proteasome component C5
(Homo sapiens (Human))
BDBM50444909
(CHEMBL3099618)
Show SMILES [#6]-[#6]\[#6](=[#6](/c1ccc(-[#8]-[#6]-[#6]-[#7]-2-[#6]-[#6]-[#6]-[#6]-[#6]-[#6]-2)cc1)-c1ccc(-[#8]-[#6]-[#6]-[#7]-2-[#6]-[#6]-[#6]-[#6]-[#6]-[#6]-2)cc1)-c1ccccc1
Show InChI InChI=1S/C38H50N2O2/c1-2-37(32-14-8-7-9-15-32)38(33-16-20-35(21-17-33)41-30-28-39-24-10-3-4-11-25-39)34-18-22-36(23-19-34)42-31-29-40-26-12-5-6-13-27-40/h7-9,14-23H,2-6,10-13,24-31H2,1H3
Reactome pathway
n/an/a>1.00E+5n/an/an/an/an/an/a
Nagahama Institute of Bio-Science and Technology
Curated by ChEMBL
Assay Description
Inhibition of PGPH activity of human 26S proteasome using Z-LLE-MCA as substrate measured for 1 hr by fluorescence assay
Eur J Med Chem 146: 636-650 (2018)
Article DOI: 10.1016/j.ejmech.2018.01.045
BindingDB Entry DOI: 10.7270/Q2DF6TV7
Proteasome component C5
(Homo sapiens (Human))
BDBM50444909
(CHEMBL3099618)
Show SMILES [#6]-[#6]\[#6](=[#6](/c1ccc(-[#8]-[#6]-[#6]-[#7]-2-[#6]-[#6]-[#6]-[#6]-[#6]-[#6]-2)cc1)-c1ccc(-[#8]-[#6]-[#6]-[#7]-2-[#6]-[#6]-[#6]-[#6]-[#6]-[#6]-2)cc1)-c1ccccc1
Show InChI InChI=1S/C38H50N2O2/c1-2-37(32-14-8-7-9-15-32)38(33-16-20-35(21-17-33)41-30-28-39-24-10-3-4-11-25-39)34-18-22-36(23-19-34)42-31-29-40-26-12-5-6-13-27-40/h7-9,14-23H,2-6,10-13,24-31H2,1H3
Reactome pathway
n/an/a 430n/an/an/an/an/an/a
Institute of Bio-Science and Technology
Curated by ChEMBL
Assay Description
Inhibition of PGPH-like activity of human 20S proteasome beta 1 subunit assessed as hydrolysis of Z-LLE-AMC fluorogenic substrate measured for 1 hr b...
Eur J Med Chem 71: 290-305 (2014)
Article DOI: 10.1016/j.ejmech.2013.11.009
BindingDB Entry DOI: 10.7270/Q2222W81
20S proteasome chymotrypsin-like
(Homo sapiens (Human))
BDBM50444909
(CHEMBL3099618)
Show SMILES [#6]-[#6]\[#6](=[#6](/c1ccc(-[#8]-[#6]-[#6]-[#7]-2-[#6]-[#6]-[#6]-[#6]-[#6]-[#6]-2)cc1)-c1ccc(-[#8]-[#6]-[#6]-[#7]-2-[#6]-[#6]-[#6]-[#6]-[#6]-[#6]-2)cc1)-c1ccccc1
Show InChI InChI=1S/C38H50N2O2/c1-2-37(32-14-8-7-9-15-32)38(33-16-20-35(21-17-33)41-30-28-39-24-10-3-4-11-25-39)34-18-22-36(23-19-34)42-31-29-40-26-12-5-6-13-27-40/h7-9,14-23H,2-6,10-13,24-31H2,1H3
Reactome pathway
n/an/a 640n/an/an/an/an/an/a
Institute of Bio-Science and Technology
Curated by ChEMBL
Assay Description
Inhibition of chymotrypsin-like activity of human 20S proteasome beta 5 subunit assessed as hydrolysis of succinyl-LLVY-AMC fluorogenic substrate mea...
Eur J Med Chem 71: 290-305 (2014)
Article DOI: 10.1016/j.ejmech.2013.11.009
BindingDB Entry DOI: 10.7270/Q2222W81
Proteasome Macropain subunit
(Homo sapiens (Human))
BDBM50444909
(CHEMBL3099618)
Show SMILES [#6]-[#6]\[#6](=[#6](/c1ccc(-[#8]-[#6]-[#6]-[#7]-2-[#6]-[#6]-[#6]-[#6]-[#6]-[#6]-2)cc1)-c1ccc(-[#8]-[#6]-[#6]-[#7]-2-[#6]-[#6]-[#6]-[#6]-[#6]-[#6]-2)cc1)-c1ccccc1
Show InChI InChI=1S/C38H50N2O2/c1-2-37(32-14-8-7-9-15-32)38(33-16-20-35(21-17-33)41-30-28-39-24-10-3-4-11-25-39)34-18-22-36(23-19-34)42-31-29-40-26-12-5-6-13-27-40/h7-9,14-23H,2-6,10-13,24-31H2,1H3
Reactome pathway
n/an/a>1.00E+5n/an/an/an/an/an/a
Nagahama Institute of Bio-Science and Technology
Curated by ChEMBL
Assay Description
Inhibition of trypsin-like activity of human 26S proteasome using Boc-LRR-MCA as substrate measured for 1 hr by fluorescence assay
Eur J Med Chem 146: 636-650 (2018)
Article DOI: 10.1016/j.ejmech.2018.01.045
BindingDB Entry DOI: 10.7270/Q2DF6TV7