BDBM50449261 CHEMBL3125331
SMILES: COCC1(CC(=NO1)c1ccc2c(c1)nc(CCCCC(O)=O)n(-c1ccc(F)cc1)c2=O)c1ccccc1
InChI Key: InChIKey=ULKNRPLKMTVYOB-UHFFFAOYSA-N
Data: 1 KI  1 IC50
Activity Spreadsheet -- Enzyme Inhibition Constant Data from BindingDB
Found 2 hits for monomerid = 50449261
Trg + Lig
Ki
nM
ΔG°
kcal/mole
IC50
nM
Kd
nM
EC50/IC50
nM
koff
s-1
kon
M-1s-1
pHTemp
°C
G protein-coupled receptor 44
(Homo sapiens (Human))
BDBM50449261
(CHEMBL3125331)
Show SMILES COCC1(CC(=NO1)c1ccc2c(c1)nc(CCCCC(O)=O)n(-c1ccc(F)cc1)c2=O)c1ccccc1 |c:5|
Show InChI InChI=1S/C30H28FN3O5/c1-38-19-30(21-7-3-2-4-8-21)18-26(33-39-30)20-11-16-24-25(17-20)32-27(9-5-6-10-28(35)36)34(29(24)37)23-14-12-22(31)13-15-23/h2-4,7-8,11-17H,5-6,9-10,18-19H2,1H3,(H,35,36)
Reactome pathway
1.90n/an/an/an/an/an/an/an/a
Merck Research Laboratories
Curated by ChEMBL
Assay Description
Antagonist activity at human CRTH2 receptor expressed in CHO-1 cells assessed as inhibition of PGD2-induced Ca2+ flux preincubated for 30 mins follow...
Bioorg Med Chem Lett 24: 1615-20 (2014)
Article DOI: 10.1016/j.bmcl.2014.01.043
BindingDB Entry DOI: 10.7270/Q2JQ12G9
G protein-coupled receptor 44
(Homo sapiens (Human))
BDBM50449261
(CHEMBL3125331)
Show SMILES COCC1(CC(=NO1)c1ccc2c(c1)nc(CCCCC(O)=O)n(-c1ccc(F)cc1)c2=O)c1ccccc1 |c:5|
Show InChI InChI=1S/C30H28FN3O5/c1-38-19-30(21-7-3-2-4-8-21)18-26(33-39-30)20-11-16-24-25(17-20)32-27(9-5-6-10-28(35)36)34(29(24)37)23-14-12-22(31)13-15-23/h2-4,7-8,11-17H,5-6,9-10,18-19H2,1H3,(H,35,36)
Reactome pathway
n/an/a 80n/an/an/an/an/an/a
Merck Research Laboratories
Curated by ChEMBL
Assay Description
Antagonist activity at human CRTH2 receptor expressed in HEK cells assessed as inhibition of forskolin-induced cAMP formation preincubated for 10 min...
Bioorg Med Chem Lett 24: 1615-20 (2014)
Article DOI: 10.1016/j.bmcl.2014.01.043
BindingDB Entry DOI: 10.7270/Q2JQ12G9