BDBM50465853 CHEMBL4283314
SMILES: Cc1ccc2oc(cc(=O)c2c1)-c1ccc(OCCCCc2cn(CCOCCOc3ccc4c(c3)oc(cc4=O)-c3ccccc3)nn2)cc1
InChI Key: InChIKey=IJOIRCPQRBNWJL-UHFFFAOYSA-N
Data: 4 EC50
Activity Spreadsheet -- Enzyme Inhibition Constant Data from BindingDB
Found 4 hits for monomerid = 50465853
Trg + Lig
Ki
nM
ΔG°
kcal/mole
IC50
nM
Kd
nM
EC50/IC50
nM
koff
s-1
kon
M-1s-1
pHTemp
°C
Multidrug resistance protein 1/Multidrug resistance associated protein 1
(Homo sapiens (Human))
BDBM50465853
(CHEMBL4283314)
Show SMILES Cc1ccc2oc(cc(=O)c2c1)-c1ccc(OCCCCc2cn(CCOCCOc3ccc4c(c3)oc(cc4=O)-c3ccccc3)nn2)cc1
Show InChI InChI=1S/C41H37N3O7/c1-28-10-17-38-35(23-28)37(46)26-40(50-38)30-11-13-32(14-12-30)48-19-6-5-9-31-27-44(43-42-31)18-20-47-21-22-49-33-15-16-34-36(45)25-39(51-41(34)24-33)29-7-3-2-4-8-29/h2-4,7-8,10-17,23-27H,5-6,9,18-22H2,1H3
n/an/an/an/a 175n/an/an/an/a
Hong Kong Polytechnic University
Curated by ChEMBL
Assay Description
Inhibition of MRP1 in human 2008/MRP1 cells assessed as potentiation of doxorubicin-induced cytotoxicity by measuring reduction in cell survival afte...
J Med Chem 61: 9931-9951 (2018)
Article DOI: 10.1021/acs.jmedchem.8b00834
BindingDB Entry DOI: 10.7270/Q2RX9FRD
ATP-binding cassette sub-family G member 2
(Homo sapiens (Human))
BDBM50465853
(CHEMBL4283314)
Show SMILES Cc1ccc2oc(cc(=O)c2c1)-c1ccc(OCCCCc2cn(CCOCCOc3ccc4c(c3)oc(cc4=O)-c3ccccc3)nn2)cc1
Show InChI InChI=1S/C41H37N3O7/c1-28-10-17-38-35(23-28)37(46)26-40(50-38)30-11-13-32(14-12-30)48-19-6-5-9-31-27-44(43-42-31)18-20-47-21-22-49-33-15-16-34-36(45)25-39(51-41(34)24-33)29-7-3-2-4-8-29/h2-4,7-8,10-17,23-27H,5-6,9,18-22H2,1H3
NCI pathway
Reactome pathway
n/an/an/an/a 28n/an/an/an/a
Hong Kong Polytechnic University
Curated by ChEMBL
Assay Description
Inhibition of BCRP (unknown origin) transfected in HEK293/R2 cells assessed as reversal of topotecan resistance after 5 days by MTS/PMS assay
J Med Chem 62: 8578-8608 (2019)
Article DOI: 10.1021/acs.jmedchem.9b00963
Multidrug resistance protein 1/Multidrug resistance associated protein 1
(Homo sapiens (Human))
BDBM50465853
(CHEMBL4283314)
Show SMILES Cc1ccc2oc(cc(=O)c2c1)-c1ccc(OCCCCc2cn(CCOCCOc3ccc4c(c3)oc(cc4=O)-c3ccccc3)nn2)cc1
Show InChI InChI=1S/C41H37N3O7/c1-28-10-17-38-35(23-28)37(46)26-40(50-38)30-11-13-32(14-12-30)48-19-6-5-9-31-27-44(43-42-31)18-20-47-21-22-49-33-15-16-34-36(45)25-39(51-41(34)24-33)29-7-3-2-4-8-29/h2-4,7-8,10-17,23-27H,5-6,9,18-22H2,1H3
n/an/an/an/a 160n/an/an/an/a
Hong Kong Polytechnic University
Curated by ChEMBL
Assay Description
Inhibition of P-gp (unknown origin) expressed in human LCC6MDR cells assessed as reversal of paclitaxel resistance after 5 days by MTS/PMS assay
J Med Chem 62: 8578-8608 (2019)
Article DOI: 10.1021/acs.jmedchem.9b00963
ATP-binding cassette sub-family G member 2
(Homo sapiens (Human))
BDBM50465853
(CHEMBL4283314)
Show SMILES Cc1ccc2oc(cc(=O)c2c1)-c1ccc(OCCCCc2cn(CCOCCOc3ccc4c(c3)oc(cc4=O)-c3ccccc3)nn2)cc1
Show InChI InChI=1S/C41H37N3O7/c1-28-10-17-38-35(23-28)37(46)26-40(50-38)30-11-13-32(14-12-30)48-19-6-5-9-31-27-44(43-42-31)18-20-47-21-22-49-33-15-16-34-36(45)25-39(51-41(34)24-33)29-7-3-2-4-8-29/h2-4,7-8,10-17,23-27H,5-6,9,18-22H2,1H3
NCI pathway
Reactome pathway
n/an/an/an/a 135n/an/an/an/a
Hong Kong Polytechnic University
Curated by ChEMBL
Assay Description
Inhibition of BCRP in human MCF7/MX100 cells assessed as reversal of topotecan resistance after 5 days by MTS/PMS assay
J Med Chem 62: 8578-8608 (2019)
Article DOI: 10.1021/acs.jmedchem.9b00963