BDBM50506660 CHEMBL4528881
SMILES:
InChI Key: InChIKey=OPHQVUNMCJRXJP-UHFFFAOYSA-N
Data: 2 IC50
Activity Spreadsheet -- Enzyme Inhibition Constant Data from BindingDB
Found 2 hits for monomerid = 50506660
Trg + Lig
Ki
nM
ΔG°
kcal/mole
IC50
nM
Kd
nM
EC50/IC50
nM
koff
s-1
kon
M-1s-1
pHTemp
°C
Tau-tubulin kinase 2
(Homo sapiens (Human))
BDBM50506660
(CHEMBL4528881)
Show InChI InChI=1S/C19H23BrN6O/c1-19(21)5-2-13(3-6-19)24-16-4-7-26-17(16)18(22-11-23-26)25-14-8-12(20)9-15(27)10-14/h4,7-11,13,24,27H,2-3,5-6,21H2,1H3,(H,22,23,25)
n/an/a 170n/an/an/an/an/an/a
Centro de Investigaciones Biol�gicas-CSIC
Curated by ChEMBL
Assay Description
Inhibition of TTBK2 (unknown origin)
Eur J Med Chem 161: 39-47 (2019)
Article DOI: 10.1016/j.ejmech.2018.10.030
Tau-tubulin kinase 1
(Homo sapiens (Human))
BDBM50506660
(CHEMBL4528881)
Show InChI InChI=1S/C19H23BrN6O/c1-19(21)5-2-13(3-6-19)24-16-4-7-26-17(16)18(22-11-23-26)25-14-8-12(20)9-15(27)10-14/h4,7-11,13,24,27H,2-3,5-6,21H2,1H3,(H,22,23,25)
n/an/a 120n/an/an/an/an/an/a
Centro de Investigaciones Biol�gicas-CSIC
Curated by ChEMBL
Assay Description
Inhibition of TTBK1 (unknown origin)
Eur J Med Chem 161: 39-47 (2019)
Article DOI: 10.1016/j.ejmech.2018.10.030