null
SMILES:
InChI Key:
PDB links: 1 PDB ID matches this monomer.
Activity Spreadsheet -- Enzyme Inhibition Constant Data from BindingDB
Found 4 hits for monomerid = 50554034
Trg + Lig
Ki
nM
ΔG°
kcal/mole
IC50
nM
Kd
nM
EC50/IC50
nM
koff
s-1
kon
M-1s-1
pHTemp
°C
Myeloperoxidase
(Homo sapiens (Human))
BDBM50554034
(CHEMBL4747269)
n/an/a 1.30E+4n/an/an/an/an/an/a
TBA
Citation and Details
3D
3D Structure (crystal)
Eosinophil peroxidase
(Human)
BDBM50554034
(CHEMBL4747269)
n/an/a 92n/an/an/an/an/an/a
TBA
Citation and Details
Lactoperoxidase
(Homo sapiens (Human))
BDBM50554034
(CHEMBL4747269)
n/an/a>6.20E+4n/an/an/an/an/an/a
TBA
Citation and Details
Myeloperoxidase
(Homo sapiens (Human))
BDBM50554034
(CHEMBL4747269)
n/an/a 1n/an/an/an/an/an/a
TBA
Citation and Details
3D
3D Structure (crystal)