null
SMILES: COc1cc(cc(OC)c1OC)-c1nc(SCc2ccc(Cl)cc2)nc(Sc2nnnn2C)c1C#N
InChI Key:
Activity Spreadsheet -- Enzyme Inhibition Constant Data from BindingDB
Found 7 hits for monomerid = 50584167
Trg + Lig
Ki
nM
ΔG°
kcal/mole
IC50
nM
Kd
nM
EC50/IC50
nM
koff
s-1
kon
M-1s-1
pHTemp
°C
DCN1-like protein 1
(Homo sapiens)
BDBM50584167
(CHEMBL5085822)
Show SMILES COc1cc(cc(OC)c1OC)-c1nc(SCc2ccc(Cl)cc2)nc(Sc2nnnn2C)c1C#N
8.30n/an/an/an/an/an/an/an/a
TBA
Assay Description
Binding affinity to DCN1 (unknown origin) assessed as inhibitory constant
Citation and Details
Article DOI: 10.1021/acs.jmedchem.1c01207
BindingDB Entry DOI: 10.7270/Q2JD51NJ
DCN1-like protein 2
(Homo sapiens)
BDBM50584167
(CHEMBL5085822)
Show SMILES COc1cc(cc(OC)c1OC)-c1nc(SCc2ccc(Cl)cc2)nc(Sc2nnnn2C)c1C#N
1.88E+4n/an/an/an/an/an/an/an/a
TBA
Assay Description
Binding affinity to DCN2 (unknown origin) assessed as inhibitory constant
Citation and Details
Article DOI: 10.1021/acs.jmedchem.1c01207
BindingDB Entry DOI: 10.7270/Q2JD51NJ
DCN1-like protein 4
(Homo sapiens)
BDBM50584167
(CHEMBL5085822)
Show SMILES COc1cc(cc(OC)c1OC)-c1nc(SCc2ccc(Cl)cc2)nc(Sc2nnnn2C)c1C#N
2.24E+4n/an/an/an/an/an/an/an/a
TBA
Assay Description
Binding affinity to DCN4 (unknown origin) assessed as inhibitory constant
Citation and Details
Article DOI: 10.1021/acs.jmedchem.1c01207
BindingDB Entry DOI: 10.7270/Q2JD51NJ
DCN1-like protein 5
(Homo sapiens)
BDBM50584167
(CHEMBL5085822)
Show SMILES COc1cc(cc(OC)c1OC)-c1nc(SCc2ccc(Cl)cc2)nc(Sc2nnnn2C)c1C#N
2.89E+4n/an/an/an/an/an/an/an/a
TBA
Assay Description
Binding affinity to DCN5 (unknown origin) assessed as inhibitory constant
Citation and Details
Article DOI: 10.1021/acs.jmedchem.1c01207
BindingDB Entry DOI: 10.7270/Q2JD51NJ
DCN1-like protein 3
(Homo sapiens)
BDBM50584167
(CHEMBL5085822)
Show SMILES COc1cc(cc(OC)c1OC)-c1nc(SCc2ccc(Cl)cc2)nc(Sc2nnnn2C)c1C#N
3.85E+5n/an/an/an/an/an/an/an/a
TBA
Assay Description
Binding affinity to DCN3 (unknown origin) assessed as inhibitory constant
Citation and Details
Article DOI: 10.1021/acs.jmedchem.1c01207
BindingDB Entry DOI: 10.7270/Q2JD51NJ
DCN1-like protein 1
(Homo sapiens)
BDBM50584167
(CHEMBL5085822)
Show SMILES COc1cc(cc(OC)c1OC)-c1nc(SCc2ccc(Cl)cc2)nc(Sc2nnnn2C)c1C#N
n/an/a 9.60n/an/an/an/an/an/a
TBA
Assay Description
Inhibition of GST-tagged DCN1 (unknown origin) using AcUBE2M1-21 incubated for 30 mins by HTRF assay
Citation and Details
Article DOI: 10.1021/acs.jmedchem.1c01207
BindingDB Entry DOI: 10.7270/Q2JD51NJ
DCN1-like protein 1
(Homo sapiens)
BDBM50584167
(CHEMBL5085822)
Show SMILES COc1cc(cc(OC)c1OC)-c1nc(SCc2ccc(Cl)cc2)nc(Sc2nnnn2C)c1C#N
n/an/an/a 26n/an/an/an/an/a
TBA
Assay Description
Binding affinity to extracellular DCN1 (unknown origin) assessed as dissociation constant incubated for upto 180 secs by label-free biolayer interfer...
Citation and Details
Article DOI: 10.1021/acs.jmedchem.1c01207
BindingDB Entry DOI: 10.7270/Q2JD51NJ