null
SMILES: CC[C@H]1N(C2CCCC2)c2nc(ncc2N(C)C1=O)N(C)c1ccc(cc1OC)-c1nc2c(cccc2[nH]1)C(N)=O
InChI Key:
Activity Spreadsheet -- Enzyme Inhibition Constant Data from BindingDB
Found 14 hits for monomerid = 50586865
Trg + Lig
Ki
nM
ΔG°
kcal/mole
IC50
nM
Kd
nM
EC50/IC50
nM
koff
s-1
kon
M-1s-1
pHTemp
°C
Poly [ADP-ribose] polymerase 1
(Homo sapiens (Human))
BDBM50586865
(CHEMBL5084388)
Show SMILES CC[C@H]1N(C2CCCC2)c2nc(ncc2N(C)C1=O)N(C)c1ccc(cc1OC)-c1nc2c(cccc2[nH]1)C(N)=O |r|
n/an/a 13n/an/an/an/an/an/a
TBA
Assay Description
Inhibition of PARP1 (unknown origin) incubated for 45 mins in presence of biotinylated-NAD+ by microplate reader analysis
Citation and Details
Article DOI: 10.1021/acs.jmedchem.1c01535
BindingDB Entry DOI: 10.7270/Q22N566V
Bromodomain-containing protein 4
(Homo sapiens (Human))
BDBM50586865
(CHEMBL5084388)
Show SMILES CC[C@H]1N(C2CCCC2)c2nc(ncc2N(C)C1=O)N(C)c1ccc(cc1OC)-c1nc2c(cccc2[nH]1)C(N)=O |r|
n/an/a 101n/an/an/an/an/an/a
TBA
Assay Description
Inhibition of recombinant BRD4 (unknown origin) incubated for 120 mins by TR-FRET assay
Citation and Details
Article DOI: 10.1021/acs.jmedchem.1c01535
BindingDB Entry DOI: 10.7270/Q22N566V
Poly [ADP-ribose] polymerase 2
(Homo sapiens (Human))
BDBM50586865
(CHEMBL5084388)
Show SMILES CC[C@H]1N(C2CCCC2)c2nc(ncc2N(C)C1=O)N(C)c1ccc(cc1OC)-c1nc2c(cccc2[nH]1)C(N)=O |r|
n/an/a 4.70n/an/an/an/an/an/a
TBA
Assay Description
Inhibition of recombinant PARP2 (unknown origin) incubated for 45 mins in presence of biotinylated-NAD+ by ELISA
Citation and Details
Article DOI: 10.1021/acs.jmedchem.1c01535
BindingDB Entry DOI: 10.7270/Q22N566V
Serine/threonine-protein kinase PLK1
(Homo sapiens (Human))
BDBM50586865
(CHEMBL5084388)
Show SMILES CC[C@H]1N(C2CCCC2)c2nc(ncc2N(C)C1=O)N(C)c1ccc(cc1OC)-c1nc2c(cccc2[nH]1)C(N)=O |r|
NCI pathway
Reactome pathway
n/an/a 2.03E+3n/an/an/an/an/an/a
TBA
Assay Description
Inhibition of recombinant PLK1 (unknown origin) using lipid substrate measured after 40 mins by ADP-glo luminescence kinase assay
Citation and Details
Article DOI: 10.1021/acs.jmedchem.1c01535
BindingDB Entry DOI: 10.7270/Q22N566V
Bromodomain-containing protein 2
(Homo sapiens (Human))
BDBM50586865
(CHEMBL5084388)
Show SMILES CC[C@H]1N(C2CCCC2)c2nc(ncc2N(C)C1=O)N(C)c1ccc(cc1OC)-c1nc2c(cccc2[nH]1)C(N)=O |r|
n/an/a 381n/an/an/an/an/an/a
TBA
Assay Description
Inhibition of recombinant BRD2 BD1 (unknown origin) incubated for 120 mins by TR-FRET assay
Citation and Details
Article DOI: 10.1021/acs.jmedchem.1c01535
BindingDB Entry DOI: 10.7270/Q22N566V
Bromodomain-containing protein 2
(Homo sapiens (Human))
BDBM50586865
(CHEMBL5084388)
Show SMILES CC[C@H]1N(C2CCCC2)c2nc(ncc2N(C)C1=O)N(C)c1ccc(cc1OC)-c1nc2c(cccc2[nH]1)C(N)=O |r|
n/an/a 168n/an/an/an/an/an/a
TBA
Assay Description
Inhibition of recombinant BRD2 BD2 (unknown origin) incubated for 120 mins by TR-FRET assay
Citation and Details
Article DOI: 10.1021/acs.jmedchem.1c01535
BindingDB Entry DOI: 10.7270/Q22N566V
Histone acetyltransferase p300
(Homo sapiens (Human))
BDBM50586865
(CHEMBL5084388)
Show SMILES CC[C@H]1N(C2CCCC2)c2nc(ncc2N(C)C1=O)N(C)c1ccc(cc1OC)-c1nc2c(cccc2[nH]1)C(N)=O |r|
n/an/a 5.94E+4n/an/an/an/an/an/a
TBA
Assay Description
Inhibition of P300 (unknown orign) using acetyl-CoA as substrate preincubated for 30 mins followed by substrate addition measured after 1 hr by micro...
Citation and Details
Article DOI: 10.1021/acs.jmedchem.1c01535
BindingDB Entry DOI: 10.7270/Q22N566V
Bromodomain-containing protein 3
(Homo sapiens (Human))
BDBM50586865
(CHEMBL5084388)
Show SMILES CC[C@H]1N(C2CCCC2)c2nc(ncc2N(C)C1=O)N(C)c1ccc(cc1OC)-c1nc2c(cccc2[nH]1)C(N)=O |r|
n/an/a 123n/an/an/an/an/an/a
TBA
Assay Description
Inhibition of recombinant BRD3 BD2 (unknown origin) incubated for 120 mins by TR-FRET assay
Citation and Details
Article DOI: 10.1021/acs.jmedchem.1c01535
BindingDB Entry DOI: 10.7270/Q22N566V
Bromodomain-containing protein 4
(Homo sapiens (Human))
BDBM50586865
(CHEMBL5084388)
Show SMILES CC[C@H]1N(C2CCCC2)c2nc(ncc2N(C)C1=O)N(C)c1ccc(cc1OC)-c1nc2c(cccc2[nH]1)C(N)=O |r|
n/an/a 75n/an/an/an/an/an/a
TBA
Assay Description
Inhibition of recombinant BRD4 BD1 (unknown origin) incubated for 120 mins by TR-FRET assay
Citation and Details
Article DOI: 10.1021/acs.jmedchem.1c01535
BindingDB Entry DOI: 10.7270/Q22N566V
Bromodomain-containing protein 4
(Homo sapiens (Human))
BDBM50586865
(CHEMBL5084388)
Show SMILES CC[C@H]1N(C2CCCC2)c2nc(ncc2N(C)C1=O)N(C)c1ccc(cc1OC)-c1nc2c(cccc2[nH]1)C(N)=O |r|
n/an/a 157n/an/an/an/an/an/a
TBA
Assay Description
Inhibition of recombinant BRD4 BD2 (unknown origin) incubated for 120 mins by TR-FRET assay
Citation and Details
Article DOI: 10.1021/acs.jmedchem.1c01535
BindingDB Entry DOI: 10.7270/Q22N566V
Bromodomain testis-specific protein
(Homo sapiens (Human))
BDBM50586865
(CHEMBL5084388)
Show SMILES CC[C@H]1N(C2CCCC2)c2nc(ncc2N(C)C1=O)N(C)c1ccc(cc1OC)-c1nc2c(cccc2[nH]1)C(N)=O |r|
n/an/a 1.20E+3n/an/an/an/an/an/a
TBA
Assay Description
Inhibition of recombinant BRDT BD1 (unknown origin) incubated for 120 mins by TR-FRET assay
Citation and Details
Article DOI: 10.1021/acs.jmedchem.1c01535
BindingDB Entry DOI: 10.7270/Q22N566V
Bromodomain testis-specific protein
(Homo sapiens (Human))
BDBM50586865
(CHEMBL5084388)
Show SMILES CC[C@H]1N(C2CCCC2)c2nc(ncc2N(C)C1=O)N(C)c1ccc(cc1OC)-c1nc2c(cccc2[nH]1)C(N)=O |r|
n/an/a 1.40E+3n/an/an/an/an/an/a
TBA
Assay Description
Inhibition of recombinant BRDT BD2 (unknown origin) incubated for 120 mins by TR-FRET assay
Citation and Details
Article DOI: 10.1021/acs.jmedchem.1c01535
BindingDB Entry DOI: 10.7270/Q22N566V
Bromodomain-containing protein 1
(Homo sapiens (Human))
BDBM50586865
(CHEMBL5084388)
Show SMILES CC[C@H]1N(C2CCCC2)c2nc(ncc2N(C)C1=O)N(C)c1ccc(cc1OC)-c1nc2c(cccc2[nH]1)C(N)=O |r|
n/an/a 3.65E+4n/an/an/an/an/an/a
TBA
Assay Description
Inhibition of recombinant BRD1 (unknown origin) incubated for 120 mins by TR-FRET assay
Citation and Details
Article DOI: 10.1021/acs.jmedchem.1c01535
BindingDB Entry DOI: 10.7270/Q22N566V
Bromodomain-containing protein 3
(Homo sapiens (Human))
BDBM50586865
(CHEMBL5084388)
Show SMILES CC[C@H]1N(C2CCCC2)c2nc(ncc2N(C)C1=O)N(C)c1ccc(cc1OC)-c1nc2c(cccc2[nH]1)C(N)=O |r|
n/an/a 166n/an/an/an/an/an/a
TBA
Assay Description
Inhibition of recombinant BRD3 BD1 (unknown origin) incubated for 120 mins by TR-FRET assay
Citation and Details
Article DOI: 10.1021/acs.jmedchem.1c01535
BindingDB Entry DOI: 10.7270/Q22N566V