null
SMILES: Clc1ccc(Oc2ccc(Nc3ncnc4[nH]ccc34)cc2)cc1Cl
InChI Key:
Activity Spreadsheet -- Enzyme Inhibition Constant Data from BindingDB
Found 2 hits for monomerid = 50602919
Trg + Lig
Ki
nM
ΔG°
kcal/mole
IC50
nM
Kd
nM
EC50/IC50
nM
koff
s-1
kon
M-1s-1
pHTemp
°C
Tau-tubulin kinase 2
(Homo sapiens (Human))
BDBM50602919
(CHEMBL5169390)
Show SMILES Clc1ccc(Oc2ccc(Nc3ncnc4[nH]ccc34)cc2)cc1Cl
n/an/a 5.72E+3n/an/an/an/an/an/a
TBA
Citation and Details
Article DOI: 10.1021/acs.jmedchem.1c01942
BindingDB Entry DOI: 10.7270/Q2R215GV
Tau-tubulin kinase 1
(Homo sapiens (Human))
BDBM50602919
(CHEMBL5169390)
Show SMILES Clc1ccc(Oc2ccc(Nc3ncnc4[nH]ccc34)cc2)cc1Cl
n/an/a 2.30E+3n/an/an/an/an/an/a
TBA
Citation and Details
Article DOI: 10.1021/acs.jmedchem.1c01942
BindingDB Entry DOI: 10.7270/Q2R215GV