null
SMILES: Nc1nc(Nc2ccc(Oc3ccc(Cl)cc3)cc2)c2cc[nH]c2n1
InChI Key:
Activity Spreadsheet -- Enzyme Inhibition Constant Data from BindingDB
Found 2 hits for monomerid = 50602920
Trg + Lig
Ki
nM
ΔG°
kcal/mole
IC50
nM
Kd
nM
EC50/IC50
nM
koff
s-1
kon
M-1s-1
pHTemp
°C
Tau-tubulin kinase 2
(Homo sapiens (Human))
BDBM50602920
(CHEMBL5187125)
Show SMILES Nc1nc(Nc2ccc(Oc3ccc(Cl)cc3)cc2)c2cc[nH]c2n1
n/an/a 2.70E+3n/an/an/an/an/an/a
TBA
Citation and Details
Article DOI: 10.1021/acs.jmedchem.1c01942
BindingDB Entry DOI: 10.7270/Q2R215GV
Tau-tubulin kinase 1
(Homo sapiens (Human))
BDBM50602920
(CHEMBL5187125)
Show SMILES Nc1nc(Nc2ccc(Oc3ccc(Cl)cc3)cc2)c2cc[nH]c2n1
n/an/a 450n/an/an/an/an/an/a
TBA
Citation and Details
Article DOI: 10.1021/acs.jmedchem.1c01942
BindingDB Entry DOI: 10.7270/Q2R215GV