null
SMILES: Nc1ccc(Sc2ccc(Nc3ncnc4[nH]ccc34)cc2)cc1
InChI Key:
Activity Spreadsheet -- Enzyme Inhibition Constant Data from BindingDB
Found 2 hits for monomerid = 50602925
Trg + Lig
Ki
nM
ΔG°
kcal/mole
IC50
nM
Kd
nM
EC50/IC50
nM
koff
s-1
kon
M-1s-1
pHTemp
°C
Tau-tubulin kinase 2
(Homo sapiens (Human))
BDBM50602925
(CHEMBL5188513)
Show SMILES Nc1ccc(Sc2ccc(Nc3ncnc4[nH]ccc34)cc2)cc1
n/an/a 4.94E+3n/an/an/an/an/an/a
TBA
Citation and Details
Article DOI: 10.1021/acs.jmedchem.1c01942
BindingDB Entry DOI: 10.7270/Q2R215GV
Tau-tubulin kinase 1
(Homo sapiens (Human))
BDBM50602925
(CHEMBL5188513)
Show SMILES Nc1ccc(Sc2ccc(Nc3ncnc4[nH]ccc34)cc2)cc1
n/an/a 650n/an/an/an/an/an/a
TBA
Citation and Details
Article DOI: 10.1021/acs.jmedchem.1c01942
BindingDB Entry DOI: 10.7270/Q2R215GV