BDBM5176 (2E)-2-cyano-3-(1H-indol-3-yl)prop-2-enamide::Indole-Containing Inhibitor 10
SMILES: NC(=O)C(=C\c1c[nH]c2ccccc12)\C#N
InChI Key: InChIKey=NLJUQIIPXVMEAA-VMPITWQZSA-N
Data: 2 IC50
Activity Spreadsheet -- Enzyme Inhibition Constant Data from BindingDB
Found 2 hits for monomerid = 5176
Trg + Lig
Ki
nM
ΔG°
kcal/mole
IC50
nM
Kd
nM
EC50/IC50
nM
koff
s-1
kon
M-1s-1
pHTemp
°C
Platelet-derived growth factor receptor beta
(Homo sapiens (Human))
BDBM5176
((2E)-2-cyano-3-(1H-indol-3-yl)prop-2-enamide | Ind...)
Show SMILES NC(=O)C(=C\c1c[nH]c2ccccc12)\C#N
Show InChI InChI=1S/C12H9N3O/c13-6-8(12(14)16)5-9-7-15-11-4-2-1-3-10(9)11/h1-5,7,15H,(H2,14,16)/b8-5+
NCI pathway
Reactome pathway
n/an/a 6.50E+3n/an/an/an/an/an/a
Hebrew University of Jerusalem
Assay Description
The assay was using Swiss 3T3 cell membranes harboring EGF-R or PDGFR-beta. Receptor autophosphorylation was initiated by addition of [gamma-32P]ATP ...
J Med Chem 39: 2170-7 (1996)
Article DOI: 10.1021/jm950727b
BindingDB Entry DOI: 10.7270/Q2QF8R2N
Epidermal growth factor receptor
(Homo sapiens (Human))
BDBM5176
((2E)-2-cyano-3-(1H-indol-3-yl)prop-2-enamide | Ind...)
Show SMILES NC(=O)C(=C\c1c[nH]c2ccccc12)\C#N
Show InChI InChI=1S/C12H9N3O/c13-6-8(12(14)16)5-9-7-15-11-4-2-1-3-10(9)11/h1-5,7,15H,(H2,14,16)/b8-5+
n/an/a 6.50E+4n/an/an/an/a7.54
Hebrew University of Jerusalem
Assay Description
The assay was using Swiss 3T3 cell membranes harboring EGF-R or PDGFR-beta. Receptor autophosphorylation was initiated by addition of [gamma-32P]ATP ...
J Med Chem 39: 2170-7 (1996)
Article DOI: 10.1021/jm950727b
BindingDB Entry DOI: 10.7270/Q2QF8R2N