BDBM5187 2-(quinolin-4-ylmethylidene)propanedinitrile::4-Quinylidenemalononitrile::Quinoline-Containing Inhibitor 21
SMILES: N#C\[#6](=[#6]\c1ccnc2ccccc12)C#N
InChI Key: InChIKey=ZRTKQGYMBGEXIB-UHFFFAOYSA-N
Data: 2 IC50
Activity Spreadsheet -- Enzyme Inhibition Constant Data from BindingDB
Found 2 hits for monomerid = 5187
Trg + Lig
Ki
nM
ΔG°
kcal/mole
IC50
nM
Kd
nM
EC50/IC50
nM
koff
s-1
kon
M-1s-1
pHTemp
°C
Platelet-derived growth factor receptor beta
(Homo sapiens (Human))
BDBM5187
(2-(quinolin-4-ylmethylidene)propanedinitrile | 4-Q...)
Show SMILES N#C\[#6](=[#6]\c1ccnc2ccccc12)C#N
Show InChI InChI=1S/C13H7N3/c14-8-10(9-15)7-11-5-6-16-13-4-2-1-3-12(11)13/h1-7H
NCI pathway
Reactome pathway
n/an/a 1.00E+4n/an/an/an/an/an/a
Hebrew University of Jerusalem
Assay Description
The assay was using Swiss 3T3 cell membranes harboring EGF-R or PDGFR-beta. Receptor autophosphorylation was initiated by addition of [gamma-32P]ATP ...
J Med Chem 39: 2170-7 (1996)
Article DOI: 10.1021/jm950727b
BindingDB Entry DOI: 10.7270/Q2QF8R2N
Epidermal growth factor receptor
(Homo sapiens (Human))
BDBM5187
(2-(quinolin-4-ylmethylidene)propanedinitrile | 4-Q...)
Show SMILES N#C\[#6](=[#6]\c1ccnc2ccccc12)C#N
Show InChI InChI=1S/C13H7N3/c14-8-10(9-15)7-11-5-6-16-13-4-2-1-3-12(11)13/h1-7H
n/an/a 1.00E+4n/an/an/an/a7.54
Hebrew University of Jerusalem
Assay Description
The assay was using Swiss 3T3 cell membranes harboring EGF-R or PDGFR-beta. Receptor autophosphorylation was initiated by addition of [gamma-32P]ATP ...
J Med Chem 39: 2170-7 (1996)
Article DOI: 10.1021/jm950727b
BindingDB Entry DOI: 10.7270/Q2QF8R2N