BDBM5189 (2E)-2-cyano-3-(naphthalen-1-yl)prop-2-enamide::naphthalene deriv. 23
SMILES: NC(=O)C(=C\c1cccc2ccccc12)\C#N
InChI Key: InChIKey=AVMHTBJNERNMNF-XYOKQWHBSA-N
Data: 2 IC50
Activity Spreadsheet -- Enzyme Inhibition Constant Data from BindingDB
Found 2 hits for monomerid = 5189
Trg + Lig
Ki
nM
ΔG°
kcal/mole
IC50
nM
Kd
nM
EC50/IC50
nM
koff
s-1
kon
M-1s-1
pHTemp
°C
Platelet-derived growth factor receptor beta
(Homo sapiens (Human))
BDBM5189
((2E)-2-cyano-3-(naphthalen-1-yl)prop-2-enamide | n...)
Show SMILES NC(=O)C(=C\c1cccc2ccccc12)\C#N
Show InChI InChI=1S/C14H10N2O/c15-9-12(14(16)17)8-11-6-3-5-10-4-1-2-7-13(10)11/h1-8H,(H2,16,17)/b12-8+
NCI pathway
Reactome pathway
n/an/a>1.00E+5n/an/an/an/an/an/a
Hebrew University of Jerusalem
Assay Description
The assay was using Swiss 3T3 cell membranes harboring EGF-R or PDGFR-beta. Receptor autophosphorylation was initiated by addition of [gamma-32P]ATP ...
J Med Chem 39: 2170-7 (1996)
Article DOI: 10.1021/jm950727b
BindingDB Entry DOI: 10.7270/Q2QF8R2N
Epidermal growth factor receptor
(Homo sapiens (Human))
BDBM5189
((2E)-2-cyano-3-(naphthalen-1-yl)prop-2-enamide | n...)
Show SMILES NC(=O)C(=C\c1cccc2ccccc12)\C#N
Show InChI InChI=1S/C14H10N2O/c15-9-12(14(16)17)8-11-6-3-5-10-4-1-2-7-13(10)11/h1-8H,(H2,16,17)/b12-8+
n/an/a>1.00E+5n/an/an/an/a7.54
Hebrew University of Jerusalem
Assay Description
The assay was using Swiss 3T3 cell membranes harboring EGF-R or PDGFR-beta. Receptor autophosphorylation was initiated by addition of [gamma-32P]ATP ...
J Med Chem 39: 2170-7 (1996)
Article DOI: 10.1021/jm950727b
BindingDB Entry DOI: 10.7270/Q2QF8R2N