BDBM5228 (3R,4R,5S)-5-amino-4-acetamido-3-[methyl(2-phenylethyl)amino]cyclohex-1-ene-1-carboxylic acid::C3-Aza Carbocyclic Analogue 3d
SMILES: CN(CCc1ccccc1)[C@@H]1C=C(C[C@H](N)[C@H]1NC(C)=O)C(O)=O
InChI Key: InChIKey=JGHGNWBFWJQGDZ-GVDBMIGSSA-N
Data: 3 IC50
Activity Spreadsheet -- Enzyme Inhibition Constant Data from BindingDB
Found 3 hits for monomerid = 5228
Trg + Lig
Ki
nM
ΔG°
kcal/mole
IC50
nM
Kd
nM
EC50/IC50
nM
koff
s-1
kon
M-1s-1
pHTemp
°C
Neuraminidase A
(Influenza A virus (A/Puerto Rico/8/34/Mount Sinai(...)
BDBM5228
((3R,4R,5S)-5-amino-4-acetamido-3-[methyl(2-phenyle...)
Show SMILES CN(CCc1ccccc1)[C@@H]1C=C(C[C@H](N)[C@H]1NC(C)=O)C(O)=O |r,c:12|
Show InChI InChI=1S/C18H25N3O3/c1-12(22)20-17-15(19)10-14(18(23)24)11-16(17)21(2)9-8-13-6-4-3-5-7-13/h3-7,11,15-17H,8-10,19H2,1-2H3,(H,20,22)(H,23,24)/t15-,16+,17+/m0/s1
n/an/a 100n/an/an/an/a6.537
Gilead Sciences Inc.
Assay Description
A standard fluorimetric assay was used to measure influenza virus neuraminidase activity. The substrate 2 -(4-methylumbelliferyl)-alpha-D-acetylneura...
Bioorg Med Chem Lett 8: 3321-4 (1998)
Article DOI: 10.1016/s0960-894x(98)00587-3
BindingDB Entry DOI: 10.7270/Q2B56GXM
Sialidase
(Clostridium perfringens)
BDBM5228
((3R,4R,5S)-5-amino-4-acetamido-3-[methyl(2-phenyle...)
Show SMILES CN(CCc1ccccc1)[C@@H]1C=C(C[C@H](N)[C@H]1NC(C)=O)C(O)=O |r,c:12|
Show InChI InChI=1S/C18H25N3O3/c1-12(22)20-17-15(19)10-14(18(23)24)11-16(17)21(2)9-8-13-6-4-3-5-7-13/h3-7,11,15-17H,8-10,19H2,1-2H3,(H,20,22)(H,23,24)/t15-,16+,17+/m0/s1
n/an/a 100n/an/an/an/an/an/a
Shanghai Institute of Technology
Curated by ChEMBL
Assay Description
Inhibition of Clostridium perfringenes neuraminidase activity using 4-methylumbelliferyl-1-alpha-D-N-acetylneuramic acid sodium salt hydrate as subst...
Bioorg Med Chem Lett 27: 5429-5435 (2017)
Article DOI: 10.1016/j.bmcl.2017.11.003
BindingDB Entry DOI: 10.7270/Q2QZ2DJP
Neuraminidase B
(Influenza B virus (B/Lee/40))
BDBM5228
((3R,4R,5S)-5-amino-4-acetamido-3-[methyl(2-phenyle...)
Show SMILES CN(CCc1ccccc1)[C@@H]1C=C(C[C@H](N)[C@H]1NC(C)=O)C(O)=O |r,c:12|
Show InChI InChI=1S/C18H25N3O3/c1-12(22)20-17-15(19)10-14(18(23)24)11-16(17)21(2)9-8-13-6-4-3-5-7-13/h3-7,11,15-17H,8-10,19H2,1-2H3,(H,20,22)(H,23,24)/t15-,16+,17+/m0/s1
n/an/a 565n/an/an/an/an/an/a
Gilead Sciences Inc.
Assay Description
A standard fluorimetric assay was used to measure influenza virus neuraminidase activity. The substrate 2 -(4-methylumbelliferyl)-alpha-D-acetylneura...
Bioorg Med Chem Lett 8: 3321-4 (1998)
Article DOI: 10.1016/s0960-894x(98)00587-3
BindingDB Entry DOI: 10.7270/Q2B56GXM