BDBM5253 (3R,4R,5S)-5-amino-3-(azepan-1-yl)-4-acetamidocyclohex-1-ene-1-carboxylic acid::C3-Cyclic Amine Carbocyclic Analogue 4d
SMILES: CC(=O)N[C@@H]1[C@@H](N)CC(=C[C@H]1N1CCCCCC1)C(O)=O
InChI Key: InChIKey=ATFBWSUHEBLLLQ-BFHYXJOUSA-N
Data: 2 IC50
Activity Spreadsheet -- Enzyme Inhibition Constant Data from BindingDB
Found 2 hits for monomerid = 5253
Trg + Lig
Ki
nM
ΔG°
kcal/mole
IC50
nM
Kd
nM
EC50/IC50
nM
koff
s-1
kon
M-1s-1
pHTemp
°C
Neuraminidase B
(Influenza B virus (B/Lee/40))
BDBM5253
((3R,4R,5S)-5-amino-3-(azepan-1-yl)-4-acetamidocycl...)
Show SMILES CC(=O)N[C@@H]1[C@@H](N)CC(=C[C@H]1N1CCCCCC1)C(O)=O |r,c:8|
Show InChI InChI=1S/C15H25N3O3/c1-10(19)17-14-12(16)8-11(15(20)21)9-13(14)18-6-4-2-3-5-7-18/h9,12-14H,2-8,16H2,1H3,(H,17,19)(H,20,21)/t12-,13+,14+/m0/s1
n/an/a 7n/an/an/an/an/an/a
Gilead Sciences Inc.
Assay Description
A standard fluorimetric assay was used to measure influenza virus neuraminidase activity. The substrate 2 -(4-methylumbelliferyl)-alpha-D-acetylneura...
Bioorg Med Chem Lett 10: 1257-60 (2000)
Article DOI: 10.1016/s0960-894x(00)00214-6
BindingDB Entry DOI: 10.7270/Q22R3PWW
Neuraminidase A
(Influenza A virus (A/Puerto Rico/8/34/Mount Sinai(...)
BDBM5253
((3R,4R,5S)-5-amino-3-(azepan-1-yl)-4-acetamidocycl...)
Show SMILES CC(=O)N[C@@H]1[C@@H](N)CC(=C[C@H]1N1CCCCCC1)C(O)=O |r,c:8|
Show InChI InChI=1S/C15H25N3O3/c1-10(19)17-14-12(16)8-11(15(20)21)9-13(14)18-6-4-2-3-5-7-18/h9,12-14H,2-8,16H2,1H3,(H,17,19)(H,20,21)/t12-,13+,14+/m0/s1
n/an/a 35n/an/an/an/a6.537
Gilead Sciences Inc.
Assay Description
A standard fluorimetric assay was used to measure influenza virus neuraminidase activity. The substrate 2 -(4-methylumbelliferyl)-alpha-D-acetylneura...
Bioorg Med Chem Lett 10: 1257-60 (2000)
Article DOI: 10.1016/s0960-894x(00)00214-6
BindingDB Entry DOI: 10.7270/Q22R3PWW