null
SMILES: OC(=O)c1[nH]c2ccccc2c1C(c1c([nH]c2ccccc12)C(O)=O)c1cc(Cl)cc(c1O)[N+]([O-])=O
InChI Key: InChIKey=SHGNRLBRVBRCMJ-UHFFFAOYSA-N
Activity Spreadsheet -- Enzyme Inhibition Constant Data from BindingDB
Found 6 hits for monomerid = 53026
Trg + Lig
Ki
nM
ΔG°
kcal/mole
IC50
nM
Kd
nM
EC50/IC50
nM
koff
s-1
kon
M-1s-1
pHTemp
°C
POsterior Segregation
(Caenorhabditis elegans)
BDBM53026
(3,3'-[(5-chloro-2-hydroxy-3-nitrophenyl)methyl...)
Show SMILES OC(=O)c1[nH]c2ccccc2c1C(c1c([nH]c2ccccc12)C(O)=O)c1cc(Cl)cc(c1O)[N+]([O-])=O
Show InChI InChI=1S/C25H16ClN3O7/c26-11-9-14(23(30)17(10-11)29(35)36)18(19-12-5-1-3-7-15(12)27-21(19)24(31)32)20-13-6-2-4-8-16(13)28-22(20)25(33)34/h1-10,18,27-28,30H,(H,31,32)(H,33,34)
PCBioAssay
n/an/an/an/a 1.49E+4n/an/an/an/a
Broad Institute
Curated by PubChem BioAssay
Assay Description
Broad Institute: MLPCN maternal gene expression Project ID: 2024 Keywords: Zinc finger, C. elegans, maternal gene expression, RNA-protein interac...
PubChem Bioassay (2009)
BindingDB Entry DOI: 10.7270/Q28G8J4C
Zinc finger protein mex-5
(Caenorhabditis elegans)
BDBM53026
(3,3'-[(5-chloro-2-hydroxy-3-nitrophenyl)methyl...)
Show SMILES OC(=O)c1[nH]c2ccccc2c1C(c1c([nH]c2ccccc12)C(O)=O)c1cc(Cl)cc(c1O)[N+]([O-])=O
Show InChI InChI=1S/C25H16ClN3O7/c26-11-9-14(23(30)17(10-11)29(35)36)18(19-12-5-1-3-7-15(12)27-21(19)24(31)32)20-13-6-2-4-8-16(13)28-22(20)25(33)34/h1-10,18,27-28,30H,(H,31,32)(H,33,34)
PCBioAssay
n/an/an/an/a 9.16E+3n/an/an/an/a
Broad Institute
Curated by PubChem BioAssay
Assay Description
Broad Institute: MLPCN maternal gene expression Project ID: 2024 Keywords: Zinc finger, C. elegans, maternal gene expression, RNA-protein interac...
PubChem Bioassay (2009)
BindingDB Entry DOI: 10.7270/Q2D798VP
1-phosphatidylinositol 4,5-bisphosphate phosphodiesterase beta-3
(Homo sapiens (Human))
BDBM53026
(3,3'-[(5-chloro-2-hydroxy-3-nitrophenyl)methyl...)
Show SMILES OC(=O)c1[nH]c2ccccc2c1C(c1c([nH]c2ccccc12)C(O)=O)c1cc(Cl)cc(c1O)[N+]([O-])=O
Show InChI InChI=1S/C25H16ClN3O7/c26-11-9-14(23(30)17(10-11)29(35)36)18(19-12-5-1-3-7-15(12)27-21(19)24(31)32)20-13-6-2-4-8-16(13)28-22(20)25(33)34/h1-10,18,27-28,30H,(H,31,32)(H,33,34)
NCI pathway
Reactome pathway
PCBioAssay
n/an/a 1.22E+5n/an/an/an/an/an/a
The Scripps Research Institute Molecular Screening Center
Curated by PubChem BioAssay
Assay Description
Source (MLPCN Center Name): The Scripps Research Institute Molecular Screening Center (SRIMSC) Center Affiliation: The Scripps Research Institute Ass...
PubChem Bioassay (2014)
BindingDB Entry DOI: 10.7270/Q2S46QKQ
Phospholipase A2
(Homo sapiens (Human))
BDBM53026
(3,3'-[(5-chloro-2-hydroxy-3-nitrophenyl)methyl...)
Show SMILES OC(=O)c1[nH]c2ccccc2c1C(c1c([nH]c2ccccc12)C(O)=O)c1cc(Cl)cc(c1O)[N+]([O-])=O
Show InChI InChI=1S/C25H16ClN3O7/c26-11-9-14(23(30)17(10-11)29(35)36)18(19-12-5-1-3-7-15(12)27-21(19)24(31)32)20-13-6-2-4-8-16(13)28-22(20)25(33)34/h1-10,18,27-28,30H,(H,31,32)(H,33,34)
Reactome pathway
PCBioAssay
n/an/a 9.04E+3n/an/an/an/an/an/a
Burnham Center for Chemical Genomics
Curated by PubChem BioAssay
Assay Description
Data Source: Sanford-Burnham Center for Chemical Genomics (SBCCG) Source Affiliation: Sanford-Burnham Medical Research Institute (SBMRI, San Diego, C...
PubChem Bioassay (2011)
BindingDB Entry DOI: 10.7270/Q26M35BC
1-phosphatidylinositol 4,5-bisphosphate phosphodiesterase gamma-1 [1-999,I813T]
(Homo sapiens (Human))
BDBM53026
(3,3'-[(5-chloro-2-hydroxy-3-nitrophenyl)methyl...)
Show SMILES OC(=O)c1[nH]c2ccccc2c1C(c1c([nH]c2ccccc12)C(O)=O)c1cc(Cl)cc(c1O)[N+]([O-])=O
Show InChI InChI=1S/C25H16ClN3O7/c26-11-9-14(23(30)17(10-11)29(35)36)18(19-12-5-1-3-7-15(12)27-21(19)24(31)32)20-13-6-2-4-8-16(13)28-22(20)25(33)34/h1-10,18,27-28,30H,(H,31,32)(H,33,34)
PCBioAssay
n/an/a 2.66E+4n/an/an/an/an/an/a
The Scripps Research Institute Molecular Screening Center
Curated by PubChem BioAssay
Assay Description
Source (MLPCN Center Name): The Scripps Research Institute Molecular Screening Center (SRIMSC) Center Affiliation: The Scripps Research Institute Ass...
PubChem Bioassay (2014)
BindingDB Entry DOI: 10.7270/Q2NC5ZV0
Cysteine protease ATG4B
(Homo sapiens (Human))
BDBM53026
(3,3'-[(5-chloro-2-hydroxy-3-nitrophenyl)methyl...)
Show SMILES OC(=O)c1[nH]c2ccccc2c1C(c1c([nH]c2ccccc12)C(O)=O)c1cc(Cl)cc(c1O)[N+]([O-])=O
Show InChI InChI=1S/C25H16ClN3O7/c26-11-9-14(23(30)17(10-11)29(35)36)18(19-12-5-1-3-7-15(12)27-21(19)24(31)32)20-13-6-2-4-8-16(13)28-22(20)25(33)34/h1-10,18,27-28,30H,(H,31,32)(H,33,34)
PCBioAssay
n/an/a 3.46E+3n/an/an/an/an/an/a
Burnham Center for Chemical Genomics
Curated by PubChem BioAssay
Assay Description
Data Source: Sanford-Burnham Center for Chemical Genomics (SBCCG) Source Affiliation: Sanford-Burnham Medical Research Institute (SBMRI, San Diego, C...
PubChem Bioassay (2011)
BindingDB Entry DOI: 10.7270/Q2BZ64H1