BDBM54759 1-(4-chloranyl-2,5-dimethoxy-phenyl)pyrrole-2,5-dione::1-(4-chloro-2,5-dimethoxy-phenyl)-3-pyrroline-2,5-quinone::1-(4-chloro-2,5-dimethoxyphenyl)-2,5-dihydro-1H-pyrrole-2,5-dione::1-(4-chloro-2,5-dimethoxyphenyl)pyrrole-2,5-dione::MLS000833773::SMR000457494::cid_2803479
SMILES: COc1cc(N2C(=O)C=CC2=O)c(OC)cc1Cl
InChI Key: InChIKey=MSIOXKFUOIDOQF-UHFFFAOYSA-N
Data: 6 IC50  1 EC50
Activity Spreadsheet -- Enzyme Inhibition Constant Data from BindingDB
Found 7 hits for monomerid = 54759
Trg + Lig
Ki
nM
ΔG°
kcal/mole
IC50
nM
Kd
nM
EC50/IC50
nM
koff
s-1
kon
M-1s-1
pHTemp
°C
Amyloid-beta A4 precursor protein-binding family A member 1
(Rattus norvegicus)
BDBM54759
(1-(4-chloranyl-2,5-dimethoxy-phenyl)pyrrole-2,5-di...)
Show SMILES COc1cc(N2C(=O)C=CC2=O)c(OC)cc1Cl |c:8|
Show InChI InChI=1S/C12H10ClNO4/c1-17-9-6-8(10(18-2)5-7(9)13)14-11(15)3-4-12(14)16/h3-6H,1-2H3
PCBioAssay
n/an/a 1.97E+3n/an/an/an/an/an/a
Burnham Center for Chemical Genomics
Curated by PubChem BioAssay
Assay Description
Data Source: Sanford-Burnham Center for Chemical Genomics (SBCCG) Source Affiliation: Sanford-Burnham Medical Research Institute (SBMRI, San Diego, C...
PubChem Bioassay (2009)
BindingDB Entry DOI: 10.7270/Q20P0XFH
Voltage-dependent N-type calcium channel subunit alpha-1B
(Homo sapiens (Human))
BDBM54759
(1-(4-chloranyl-2,5-dimethoxy-phenyl)pyrrole-2,5-di...)
Show SMILES COc1cc(N2C(=O)C=CC2=O)c(OC)cc1Cl |c:8|
Show InChI InChI=1S/C12H10ClNO4/c1-17-9-6-8(10(18-2)5-7(9)13)14-11(15)3-4-12(14)16/h3-6H,1-2H3
PCBioAssay
n/an/a 1.16E+4n/an/an/an/an/an/a
Burnham Center for Chemical Genomics
Curated by PubChem BioAssay
Assay Description
Data Source: Data Source: Sanford-Burnham Center for Chemical Genomics (SBCCG) Source Affiliation: Sanford-Burnham Medical Research Institute Network...
PubChem Bioassay (2009)
BindingDB Entry DOI: 10.7270/Q2PZ578V
Vacuolar aminopeptidase 1
(Saccharomyces cerevisiae)
BDBM54759
(1-(4-chloranyl-2,5-dimethoxy-phenyl)pyrrole-2,5-di...)
Show SMILES COc1cc(N2C(=O)C=CC2=O)c(OC)cc1Cl |c:8|
Show InChI InChI=1S/C12H10ClNO4/c1-17-9-6-8(10(18-2)5-7(9)13)14-11(15)3-4-12(14)16/h3-6H,1-2H3
PCBioAssay
n/an/an/an/a 1.44E+3n/an/an/an/a
NMMLSC
Curated by PubChem BioAssay
Assay Description
University of New Mexico Assay Overview: Assay Support: 1R03 MH086450-01 Project Title: Chemical Screen of TOR pathway GFP fusion proteins in S. ...
PubChem Bioassay (2010)
BindingDB Entry DOI: 10.7270/Q21R6P02
Endothelial PAS domain-containing protein 1
(Homo sapiens (Human))
BDBM54759
(1-(4-chloranyl-2,5-dimethoxy-phenyl)pyrrole-2,5-di...)
Show SMILES COc1cc(N2C(=O)C=CC2=O)c(OC)cc1Cl |c:8|
Show InChI InChI=1S/C12H10ClNO4/c1-17-9-6-8(10(18-2)5-7(9)13)14-11(15)3-4-12(14)16/h3-6H,1-2H3
Reactome pathway
PCBioAssay
n/an/a 8.55E+3n/an/an/an/an/an/a
Burnham Center for Chemical Genomics
Curated by PubChem BioAssay
PubChem Bioassay (2012)
BindingDB Entry DOI: 10.7270/Q2WS8RVZ
C-C chemokine receptor type 6
(Homo sapiens (Human))
BDBM54759
(1-(4-chloranyl-2,5-dimethoxy-phenyl)pyrrole-2,5-di...)
Show SMILES COc1cc(N2C(=O)C=CC2=O)c(OC)cc1Cl |c:8|
Show InChI InChI=1S/C12H10ClNO4/c1-17-9-6-8(10(18-2)5-7(9)13)14-11(15)3-4-12(14)16/h3-6H,1-2H3
PCBioAssay
n/an/a 2.26E+4n/an/an/an/an/an/a
Burnham Center for Chemical Genomics
Curated by PubChem BioAssay
Assay Description
Data Source: Sanford-Burnham Center for Chemical Genomics (SBCCG) Source Affiliation: Sanford-Burnham Medical Research Institute(SBMRI, San Diego, CA...
PubChem Bioassay (2011)
BindingDB Entry DOI: 10.7270/Q20P0XHD
DNA dC->dU-editing enzyme APOBEC-3G
(Homo sapiens (Human))
BDBM54759
(1-(4-chloranyl-2,5-dimethoxy-phenyl)pyrrole-2,5-di...)
Show SMILES COc1cc(N2C(=O)C=CC2=O)c(OC)cc1Cl |c:8|
Show InChI InChI=1S/C12H10ClNO4/c1-17-9-6-8(10(18-2)5-7(9)13)14-11(15)3-4-12(14)16/h3-6H,1-2H3
PCBioAssay
n/an/a 4.40E+4n/an/an/an/an/a25
Burnham Center for Chemical Genomics
Curated by PubChem BioAssay
Assay Description
Data Source: Sanford-Burnham Center for Chemical Genomics (SBCCG) Source Affiliation: Sanford-Burnham Medical Research Institute (SBMRI, San Diego, C...
PubChem Bioassay (2011)
BindingDB Entry DOI: 10.7270/Q2HQ3XD6
Beta-galactosidase
(Escherichia coli)
BDBM54759
(1-(4-chloranyl-2,5-dimethoxy-phenyl)pyrrole-2,5-di...)
Show SMILES COc1cc(N2C(=O)C=CC2=O)c(OC)cc1Cl |c:8|
Show InChI InChI=1S/C12H10ClNO4/c1-17-9-6-8(10(18-2)5-7(9)13)14-11(15)3-4-12(14)16/h3-6H,1-2H3
PCBioAssay
n/an/a>6.66E+4n/an/an/an/an/an/a
Burnham Center for Chemical Genomics
Curated by PubChem BioAssay
Assay Description
Data Source: Sanford-Burnham Center for Chemical Genomics (SBCCG) Source Affiliation: Sanford-Burnham Medical Research Institute(SBMRI, San Diego, C...
PubChem Bioassay (2011)
BindingDB Entry DOI: 10.7270/Q2NG4P4X