BDBM55181 1-[(2-methylimidazo[1,2-a]pyridin-3-yl)carbonylamino]-3-phenyl-urea::1-[(2-methylimidazo[1,2-a]pyridine-3-carbonyl)amino]-3-phenyl-urea::1-[(2-methylimidazo[1,2-a]pyridine-3-carbonyl)amino]-3-phenylurea::1-[[(2-methyl-3-imidazo[1,2-a]pyridinyl)-oxomethyl]amino]-3-phenylurea::2-[(2-methylimidazo[1,2-a]pyridin-3-yl)carbonyl]-N-phenyl-1-hydrazinecarboxamide::MLS001098340::SMR000657653::cid_2813615
SMILES: Cc1nc2ccccn2c1C(=O)NNC(=O)Nc1ccccc1
InChI Key: InChIKey=UTQDKLZEUUXTEG-UHFFFAOYSA-N
Data: 2 IC50
Activity Spreadsheet -- Enzyme Inhibition Constant Data from BindingDB
Found 2 hits for monomerid = 55181
Trg + Lig
Ki
nM
ΔG°
kcal/mole
IC50
nM
Kd
nM
EC50/IC50
nM
koff
s-1
kon
M-1s-1
pHTemp
°C
Procathepsin L
(Homo sapiens (Human))
BDBM55181
(1-[(2-methylimidazo[1,2-a]pyridin-3-yl)carbonylami...)
Show SMILES Cc1nc2ccccn2c1C(=O)NNC(=O)Nc1ccccc1
Show InChI InChI=1S/C16H15N5O2/c1-11-14(21-10-6-5-9-13(21)17-11)15(22)19-20-16(23)18-12-7-3-2-4-8-12/h2-10H,1H3,(H,19,22)(H2,18,20,23)
Reactome pathway
PCBioAssay
n/an/a>5.96E+4n/an/an/an/an/an/a
The Scripps Research Institute Molecular Screening Center
Curated by PubChem BioAssay
Assay Description
Source (MLPCN Center Name): The Scripps Research Institute Molecular Screening Center Affiliation: The Scripps Research Institute, TSRI Assay Provide...
PubChem Bioassay (2009)
BindingDB Entry DOI: 10.7270/Q20K2704
M18 aspartyl aminopeptidase
(Plasmodium falciparum 3D7)
BDBM55181
(1-[(2-methylimidazo[1,2-a]pyridin-3-yl)carbonylami...)
Show SMILES Cc1nc2ccccn2c1C(=O)NNC(=O)Nc1ccccc1
Show InChI InChI=1S/C16H15N5O2/c1-11-14(21-10-6-5-9-13(21)17-11)15(22)19-20-16(23)18-12-7-3-2-4-8-12/h2-10H,1H3,(H,19,22)(H2,18,20,23)
PCBioAssay
n/an/a 1.05E+3n/an/an/an/an/an/a
The Scripps Research Institute Molecular Screening Center
Curated by PubChem BioAssay
Assay Description
Source (MLPCN Center Name): The Scripps Research Institute Molecular Screening Center Affiliation: The Scripps Research Institute, TSRI Assay Provide...
PubChem Bioassay (2009)
BindingDB Entry DOI: 10.7270/Q24B2ZQ2