null
SMILES: CC(C)(CO)CNCc1ccc(Nc2ncc(SCc3ncc(o3)C(C)(C)C)s2)nc1
InChI Key: InChIKey=GQTPCOMZBGFWLQ-UHFFFAOYSA-N
Activity Spreadsheet -- Enzyme Inhibition Constant Data from BindingDB
Found 3 hits for monomerid = 5726
Trg + Lig
Ki
nM
ΔG°
kcal/mole
IC50
nM
Kd
nM
EC50/IC50
nM
koff
s-1
kon
M-1s-1
pHTemp
°C
Cyclin-dependent kinase/G2/mitotic-specific cyclin- 1
(Homo sapiens (Human))
BDBM5726
(2-aminothiazole deriv. | 3-[({6-[(5-{[(5-tert-buty...)
Show SMILES CC(C)(CO)CNCc1ccc(Nc2ncc(SCc3ncc(o3)C(C)(C)C)s2)nc1
Show InChI InChI=1S/C22H31N5O2S2/c1-21(2,3)16-10-25-18(29-16)12-30-19-11-26-20(31-19)27-17-7-6-15(9-24-17)8-23-13-22(4,5)14-28/h6-7,9-11,23,28H,8,12-14H2,1-5H3,(H,24,26,27)
Reactome pathway
n/an/a 18n/an/an/an/an/an/a
Bristol-Myers Squibb Company
Assay Description
The enzyme was assayed with substrate in the presence of 25 uM ATP/[gamma-33P] ATP and test compound. Dose response curves were generated to determ...
Bioorg Med Chem Lett 14: 2973-7 (2004)
Article DOI: 10.1016/j.bmcl.2004.02.105
BindingDB Entry DOI: 10.7270/Q27942WW
Cyclin-dependent kinase 4/G1/S-specific cyclin-D1
(Homo sapiens (Human))
BDBM5726
(2-aminothiazole deriv. | 3-[({6-[(5-{[(5-tert-buty...)
Show SMILES CC(C)(CO)CNCc1ccc(Nc2ncc(SCc3ncc(o3)C(C)(C)C)s2)nc1
Show InChI InChI=1S/C22H31N5O2S2/c1-21(2,3)16-10-25-18(29-16)12-30-19-11-26-20(31-19)27-17-7-6-15(9-24-17)8-23-13-22(4,5)14-28/h6-7,9-11,23,28H,8,12-14H2,1-5H3,(H,24,26,27)
NCI pathway
Reactome pathway
n/an/a 26n/an/an/an/an/an/a
Bristol-Myers Squibb Company
Assay Description
The enzyme was assayed with substrate in the presence of 25 uM ATP/[gamma-33P] ATP and test compound. Dose response curves were generated to determ...
Bioorg Med Chem Lett 14: 2973-7 (2004)
Article DOI: 10.1016/j.bmcl.2004.02.105
BindingDB Entry DOI: 10.7270/Q27942WW
Cyclin-dependent kinase 2/G1/S-specific cyclin-E1
(Homo sapiens (Human))
BDBM5726
(2-aminothiazole deriv. | 3-[({6-[(5-{[(5-tert-buty...)
Show SMILES CC(C)(CO)CNCc1ccc(Nc2ncc(SCc3ncc(o3)C(C)(C)C)s2)nc1
Show InChI InChI=1S/C22H31N5O2S2/c1-21(2,3)16-10-25-18(29-16)12-30-19-11-26-20(31-19)27-17-7-6-15(9-24-17)8-23-13-22(4,5)14-28/h6-7,9-11,23,28H,8,12-14H2,1-5H3,(H,24,26,27)
n/an/a 3n/an/an/an/a8.030
Bristol-Myers Squibb Company
Assay Description
The enzyme was assayed with substrate in the presence of 25 uM ATP/[gamma-33P] ATP and test compound. Dose response curves were generated to determ...
Bioorg Med Chem Lett 14: 2973-7 (2004)
Article DOI: 10.1016/j.bmcl.2004.02.105
BindingDB Entry DOI: 10.7270/Q27942WW