null
SMILES: Cc1ccc(NC(=O)c2cc(ccc2N2CCOCC2)N2C(=O)C=CC2=O)cc1Cl
InChI Key: InChIKey=MFLBKFTVOYEZKX-UHFFFAOYSA-N
Activity Spreadsheet -- Enzyme Inhibition Constant Data from BindingDB
Found 12 hits for monomerid = 57650
Trg + Lig
Ki
nM
ΔG°
kcal/mole
IC50
nM
Kd
nM
EC50/IC50
nM
koff
s-1
kon
M-1s-1
pHTemp
°C
Streptokinase A
(Streptococcus pyogenes M1 GAS)
BDBM57650
(5-[2,5-bis(oxidanylidene)pyrrol-1-yl]-N-(3-chloran...)
Show SMILES Cc1ccc(NC(=O)c2cc(ccc2N2CCOCC2)N2C(=O)C=CC2=O)cc1Cl |c:25|
Show InChI InChI=1S/C22H20ClN3O4/c1-14-2-3-15(12-18(14)23)24-22(29)17-13-16(26-20(27)6-7-21(26)28)4-5-19(17)25-8-10-30-11-9-25/h2-7,12-13H,8-11H2,1H3,(H,24,29)
PCBioAssay
n/an/an/an/a 6.68E+3n/an/an/an/a
Broad Institute
Curated by PubChem BioAssay
Assay Description
Keywords: Group A streptococcus, GAS, streptokinase, expression, virulence, inhibition, dose response, EC50 Assay Overview: The goal of this assa...
PubChem Bioassay (2009)
BindingDB Entry DOI: 10.7270/Q2736PBV
60S ribosomal protein L19-A
(Saccharomyces cerevisiae)
BDBM57650
(5-[2,5-bis(oxidanylidene)pyrrol-1-yl]-N-(3-chloran...)
Show SMILES Cc1ccc(NC(=O)c2cc(ccc2N2CCOCC2)N2C(=O)C=CC2=O)cc1Cl |c:25|
Show InChI InChI=1S/C22H20ClN3O4/c1-14-2-3-15(12-18(14)23)24-22(29)17-13-16(26-20(27)6-7-21(26)28)4-5-19(17)25-8-10-30-11-9-25/h2-7,12-13H,8-11H2,1H3,(H,24,29)
Reactome pathway
PCBioAssay
n/an/an/an/a 4.02E+3n/an/an/an/a
NMMLSC
Curated by PubChem BioAssay
Assay Description
University of New Mexico Assay Overview: Assay Support: 1R03 MH086450-01 Project Title: Chemical Screen of TOR pathway GFP fusion proteins in S. ...
PubChem Bioassay (2010)
BindingDB Entry DOI: 10.7270/Q2JQ0ZGP
Bcl-2-like protein 11
(Homo sapiens (Human))
BDBM57650
(5-[2,5-bis(oxidanylidene)pyrrol-1-yl]-N-(3-chloran...)
Show SMILES Cc1ccc(NC(=O)c2cc(ccc2N2CCOCC2)N2C(=O)C=CC2=O)cc1Cl |c:25|
Show InChI InChI=1S/C22H20ClN3O4/c1-14-2-3-15(12-18(14)23)24-22(29)17-13-16(26-20(27)6-7-21(26)28)4-5-19(17)25-8-10-30-11-9-25/h2-7,12-13H,8-11H2,1H3,(H,24,29)
Reactome pathway
PCBioAssay
n/an/an/an/a>3.50E+5n/an/an/an/a
Broad Institute
Curated by PubChem BioAssay
Assay Description
Keywords: apoptosis, BH3 domain, Bcl2-A1, BIM, caspase, cancer Primary Collaborator: Todd Golub, Broad Institute, golub@broadinstitute.org Assay Over...
PubChem Bioassay (2010)
BindingDB Entry DOI: 10.7270/Q24J0CKJ
Integrin alpha-4
(Homo sapiens (Human))
BDBM57650
(5-[2,5-bis(oxidanylidene)pyrrol-1-yl]-N-(3-chloran...)
Show SMILES Cc1ccc(NC(=O)c2cc(ccc2N2CCOCC2)N2C(=O)C=CC2=O)cc1Cl |c:25|
Show InChI InChI=1S/C22H20ClN3O4/c1-14-2-3-15(12-18(14)23)24-22(29)17-13-16(26-20(27)6-7-21(26)28)4-5-19(17)25-8-10-30-11-9-25/h2-7,12-13H,8-11H2,1H3,(H,24,29)
PCBioAssay
n/an/an/an/a 5.50E+3n/an/an/an/a
NMMLSC
Curated by PubChem BioAssay
Assay Description
University of New Mexico Assay Overview: Assay Support Project Title:HTS for Identification of VLA-4 Allosteric Modulators 1 R01 HL081062-01 PI:Lar...
PubChem Bioassay (2010)
BindingDB Entry DOI: 10.7270/Q2ZG6QP2
Glucose-6-phosphate 1-dehydrogenase
(Homo sapiens (Human))
BDBM57650
(5-[2,5-bis(oxidanylidene)pyrrol-1-yl]-N-(3-chloran...)
Show SMILES Cc1ccc(NC(=O)c2cc(ccc2N2CCOCC2)N2C(=O)C=CC2=O)cc1Cl |c:25|
Show InChI InChI=1S/C22H20ClN3O4/c1-14-2-3-15(12-18(14)23)24-22(29)17-13-16(26-20(27)6-7-21(26)28)4-5-19(17)25-8-10-30-11-9-25/h2-7,12-13H,8-11H2,1H3,(H,24,29)
PCBioAssay
n/an/a 4.81E+4n/an/an/an/an/an/a
Burnham Center for Chemical Genomics
Curated by PubChem BioAssay
Assay Description
Data Source: Sanford-Burnham Center for Chemical Genomics (SBCCG) Source Affiliation: Sanford-Burnham Medical Research Institute (SBMRI, San Diego CA...
PubChem Bioassay (2011)
BindingDB Entry DOI: 10.7270/Q2V12389
Endothelial PAS domain-containing protein 1
(Homo sapiens (Human))
BDBM57650
(5-[2,5-bis(oxidanylidene)pyrrol-1-yl]-N-(3-chloran...)
Show SMILES Cc1ccc(NC(=O)c2cc(ccc2N2CCOCC2)N2C(=O)C=CC2=O)cc1Cl |c:25|
Show InChI InChI=1S/C22H20ClN3O4/c1-14-2-3-15(12-18(14)23)24-22(29)17-13-16(26-20(27)6-7-21(26)28)4-5-19(17)25-8-10-30-11-9-25/h2-7,12-13H,8-11H2,1H3,(H,24,29)
Reactome pathway
PCBioAssay
n/an/a 5.36E+3n/an/an/an/an/an/a
Burnham Center for Chemical Genomics
Curated by PubChem BioAssay
PubChem Bioassay (2012)
BindingDB Entry DOI: 10.7270/Q2WS8RVZ
Glucose-6-phosphate dehydrogenase-6-phosphogluconolactonase
(Plasmodium falciparum 3D7)
BDBM57650
(5-[2,5-bis(oxidanylidene)pyrrol-1-yl]-N-(3-chloran...)
Show SMILES Cc1ccc(NC(=O)c2cc(ccc2N2CCOCC2)N2C(=O)C=CC2=O)cc1Cl |c:25|
Show InChI InChI=1S/C22H20ClN3O4/c1-14-2-3-15(12-18(14)23)24-22(29)17-13-16(26-20(27)6-7-21(26)28)4-5-19(17)25-8-10-30-11-9-25/h2-7,12-13H,8-11H2,1H3,(H,24,29)
PCBioAssay
n/an/a>8.00E+4n/an/an/an/an/an/a
Burnham Center for Chemical Genomics
Curated by PubChem BioAssay
Assay Description
Data Source: Sanford-Burnham Center for Chemical Genomics (SBCCG) Source Affiliation: Sanford-Burnham Medical Research Institute (SBMRI, San Diego CA...
PubChem Bioassay (2011)
BindingDB Entry DOI: 10.7270/Q27H1H3W
Glucose-6-phosphate dehydrogenase-6-phosphogluconolactonase
(Plasmodium falciparum 3D7)
BDBM57650
(5-[2,5-bis(oxidanylidene)pyrrol-1-yl]-N-(3-chloran...)
Show SMILES Cc1ccc(NC(=O)c2cc(ccc2N2CCOCC2)N2C(=O)C=CC2=O)cc1Cl |c:25|
Show InChI InChI=1S/C22H20ClN3O4/c1-14-2-3-15(12-18(14)23)24-22(29)17-13-16(26-20(27)6-7-21(26)28)4-5-19(17)25-8-10-30-11-9-25/h2-7,12-13H,8-11H2,1H3,(H,24,29)
PCBioAssay
n/an/a>8.00E+4n/an/an/an/an/an/a
Burnham Center for Chemical Genomics
Curated by PubChem BioAssay
Assay Description
Data Source: Sanford-Burnham Center for Chemical Genomics (SBCCG) Source Affiliation: Sanford-Burnham Medical Research Institute (SBMRI, San Diego CA...
PubChem Bioassay (2011)
BindingDB Entry DOI: 10.7270/Q23T9FQ1
Toll-like receptor 9
(Homo sapiens (Human))
BDBM57650
(5-[2,5-bis(oxidanylidene)pyrrol-1-yl]-N-(3-chloran...)
Show SMILES Cc1ccc(NC(=O)c2cc(ccc2N2CCOCC2)N2C(=O)C=CC2=O)cc1Cl |c:25|
Show InChI InChI=1S/C22H20ClN3O4/c1-14-2-3-15(12-18(14)23)24-22(29)17-13-16(26-20(27)6-7-21(26)28)4-5-19(17)25-8-10-30-11-9-25/h2-7,12-13H,8-11H2,1H3,(H,24,29)
PCBioAssay
n/an/a 5.48E+3n/an/an/an/an/an/a
The Scripps Research Institute Molecular Screening Center
Curated by PubChem BioAssay
Assay Description
Source (MLPCN Center Name): The Scripps Research Institute Molecular Screening Center (SRIMSC) Affiliation: The Scripps Research Institute, TSRI Assa...
PubChem Bioassay (2011)
BindingDB Entry DOI: 10.7270/Q2KS6Q2P
Beta-lactamase
(Pseudomonas aeruginosa)
BDBM57650
(5-[2,5-bis(oxidanylidene)pyrrol-1-yl]-N-(3-chloran...)
Show SMILES Cc1ccc(NC(=O)c2cc(ccc2N2CCOCC2)N2C(=O)C=CC2=O)cc1Cl |c:25|
Show InChI InChI=1S/C22H20ClN3O4/c1-14-2-3-15(12-18(14)23)24-22(29)17-13-16(26-20(27)6-7-21(26)28)4-5-19(17)25-8-10-30-11-9-25/h2-7,12-13H,8-11H2,1H3,(H,24,29)
PCBioAssay
n/an/a 9.48E+3n/an/an/an/an/an/a
The Scripps Research Institute Molecular Screening Center
Curated by PubChem BioAssay
Assay Description
Source (MLPCN Center Name): The Scripps Research Institute Molecular Screening Center (SRIMSC) Affiliation: The Scripps Research Institute, TSRI Assa...
PubChem Bioassay (2011)
BindingDB Entry DOI: 10.7270/Q2G15ZB8
Melanocortin receptor 4
(Homo sapiens (Human))
BDBM57650
(5-[2,5-bis(oxidanylidene)pyrrol-1-yl]-N-(3-chloran...)
Show SMILES Cc1ccc(NC(=O)c2cc(ccc2N2CCOCC2)N2C(=O)C=CC2=O)cc1Cl |c:25|
Show InChI InChI=1S/C22H20ClN3O4/c1-14-2-3-15(12-18(14)23)24-22(29)17-13-16(26-20(27)6-7-21(26)28)4-5-19(17)25-8-10-30-11-9-25/h2-7,12-13H,8-11H2,1H3,(H,24,29)
PCBioAssay
n/an/a 8.43E+3n/an/an/an/an/an/a
The Scripps Research Institute Molecular Screening Center
Curated by PubChem BioAssay
Assay Description
Source (MLPCN Center Name): The Scripps Research Institute Molecular Screening Center (SRISMC) Center Affiliation: The Scripps Research Institute, TS...
PubChem Bioassay (2012)
BindingDB Entry DOI: 10.7270/Q2FT8JMN
Glucose-6-phosphate dehydrogenase-6-phosphogluconolactonase
(Plasmodium falciparum 3D7)
BDBM57650
(5-[2,5-bis(oxidanylidene)pyrrol-1-yl]-N-(3-chloran...)
Show SMILES Cc1ccc(NC(=O)c2cc(ccc2N2CCOCC2)N2C(=O)C=CC2=O)cc1Cl |c:25|
Show InChI InChI=1S/C22H20ClN3O4/c1-14-2-3-15(12-18(14)23)24-22(29)17-13-16(26-20(27)6-7-21(26)28)4-5-19(17)25-8-10-30-11-9-25/h2-7,12-13H,8-11H2,1H3,(H,24,29)
PCBioAssay
n/an/a 1.22E+4n/an/an/an/an/an/a
Burnham Center for Chemical Genomics
Curated by PubChem BioAssay
Assay Description
Data Source: Sanford-Burnham Center for Chemical Genomics (SBCCG) Source Affiliation: Sanford-Burnham Medical Research Institute (SBMRI, San Diego CA...
PubChem Bioassay (2011)
BindingDB Entry DOI: 10.7270/Q2ZS2TZG