BDBM60504 2-(3,4-dihydroxyphenyl)-5,7-dihydroxy-8-[(3R,4R,5S,6R)-3,4,5-trihydroxy-6-(hydroxymethyl)-2-oxanyl]-1-benzopyran-4-one::2-(3,4-dihydroxyphenyl)-5,7-dihydroxy-8-[(3R,4R,5S,6R)-3,4,5-trihydroxy-6-(hydroxymethyl)oxan-2-yl]chromen-4-one::2-(3,4-dihydroxyphenyl)-5,7-dihydroxy-8-[(3R,4R,5S,6R)-3,4,5-trihydroxy-6-methylol-tetrahydropyran-2-yl]chromone::2-[3,4-bis(oxidanyl)phenyl]-8-[(3R,4R,5S,6R)-6-(hydroxymethyl)-3,4,5-tris(oxidanyl)oxan-2-yl]-5,7-bis(oxidanyl)chromen-4-one::MLS000574957::SMR000232359::cid_12004585
SMILES: OC[C@H]1OC([C@H](O)[C@@H](O)[C@@H]1O)c1c(O)cc(O)c2c1oc(cc2=O)-c1ccc(O)c(O)c1
InChI Key: InChIKey=PLAPMLGJVGLZOV-YWFAZRBLSA-N
Data: 2 IC50
Activity Spreadsheet -- Enzyme Inhibition Constant Data from BindingDB
Found 2 hits for monomerid = 60504
Trg + Lig
Ki
nM
ΔG°
kcal/mole
IC50
nM
Kd
nM
EC50/IC50
nM
koff
s-1
kon
M-1s-1
pHTemp
°C
lens epithelium-derived growth factor p75
(Homo sapiens (Human))
BDBM60504
(2-(3,4-dihydroxyphenyl)-5,7-dihydroxy-8-[(3R,4R,5S...)
Show SMILES OC[C@H]1OC([C@H](O)[C@@H](O)[C@@H]1O)c1c(O)cc(O)c2c1oc(cc2=O)-c1ccc(O)c(O)c1
Show InChI InChI=1S/C21H20O11/c22-6-14-17(28)18(29)19(30)21(32-14)16-11(26)4-10(25)15-12(27)5-13(31-20(15)16)7-1-2-8(23)9(24)3-7/h1-5,14,17-19,21-26,28-30H,6H2/t14-,17-,18+,19-,21?/m1/s1
Reactome pathway
PCBioAssay
n/an/a 1.26E+3n/an/an/an/an/an/a
The Scripps Research Institute Molecular Screening Center
Curated by PubChem BioAssay
Assay Description
Source (MLPCN Center Name): The Scripps Research Institute Molecular Screening Center (SRIMSC) Affiliation: Ohio State University Assay Provider: Mam...
PubChem Bioassay (2014)
BindingDB Entry DOI: 10.7270/Q2KD1WKS
lens epithelium-derived growth factor p75
(Homo sapiens (Human))
BDBM60504
(2-(3,4-dihydroxyphenyl)-5,7-dihydroxy-8-[(3R,4R,5S...)
Show SMILES OC[C@H]1OC([C@H](O)[C@@H](O)[C@@H]1O)c1c(O)cc(O)c2c1oc(cc2=O)-c1ccc(O)c(O)c1
Show InChI InChI=1S/C21H20O11/c22-6-14-17(28)18(29)19(30)21(32-14)16-11(26)4-10(25)15-12(27)5-13(31-20(15)16)7-1-2-8(23)9(24)3-7/h1-5,14,17-19,21-26,28-30H,6H2/t14-,17-,18+,19-,21?/m1/s1
Reactome pathway
PCBioAssay
n/an/a 245n/an/an/an/an/an/a
The Scripps Research Institute Molecular Screening Center
Curated by PubChem BioAssay
Assay Description
Source (MLPCN Center Name): The Scripps Research Institute Molecular Screening Center (SRIMSC) Affiliation: Ohio State University Assay Provider: Mam...
PubChem Bioassay (2014)
BindingDB Entry DOI: 10.7270/Q2Q52N9H