null
SMILES: Sc1nnc(NC(=O)Cn2c3ccccc3oc2=O)s1
InChI Key: InChIKey=KVHHIDWBDMEORU-UHFFFAOYSA-N
Activity Spreadsheet -- Enzyme Inhibition Constant Data from BindingDB
Found 3 hits for monomerid = 60691
Trg + Lig
Ki
nM
ΔG°
kcal/mole
IC50
nM
Kd
nM
EC50/IC50
nM
koff
s-1
kon
M-1s-1
pHTemp
°C
DNA dC->dU-editing enzyme APOBEC-3G
(Homo sapiens (Human))
BDBM60691
(2-(2-keto-1,3-benzoxazol-3-yl)-N-(2-thioxo-3H-1,3,...)
Show SMILES Sc1nnc(NC(=O)Cn2c3ccccc3oc2=O)s1
Show InChI InChI=1S/C11H8N4O3S2/c16-8(12-9-13-14-10(19)20-9)5-15-6-3-1-2-4-7(6)18-11(15)17/h1-4H,5H2,(H,14,19)(H,12,13,16)
PCBioAssay
n/an/a 2.44E+3n/an/an/an/an/a25
Burnham Center for Chemical Genomics
Curated by PubChem BioAssay
Assay Description
Data Source: Sanford-Burnham Center for Chemical Genomics (SBCCG) Source Affiliation: Sanford-Burnham Medical Research Institute (SBMRI, San Diego, C...
PubChem Bioassay (2011)
BindingDB Entry DOI: 10.7270/Q2HQ3XD6
Mitochondrial peptide methionine sulfoxide reductase
(Bos taurus)
BDBM60691
(2-(2-keto-1,3-benzoxazol-3-yl)-N-(2-thioxo-3H-1,3,...)
Show SMILES Sc1nnc(NC(=O)Cn2c3ccccc3oc2=O)s1
Show InChI InChI=1S/C11H8N4O3S2/c16-8(12-9-13-14-10(19)20-9)5-15-6-3-1-2-4-7(6)18-11(15)17/h1-4H,5H2,(H,14,19)(H,12,13,16)
PCBioAssay
n/an/an/an/a>1.04E+5n/an/an/an/a
The Scripps Research Institute Molecular Screening Center
Curated by PubChem BioAssay
Assay Description
Source (MLPCN Center Name): The Scripps Research Institute Molecular Screening Center (SRIMSC) Affiliation: The Scripps Research Institute, TSRI Assa...
PubChem Bioassay (2012)
BindingDB Entry DOI: 10.7270/Q2BZ64NT
DNA dC->dU-editing enzyme APOBEC-3A
(Homo sapiens (Human))
BDBM60691
(2-(2-keto-1,3-benzoxazol-3-yl)-N-(2-thioxo-3H-1,3,...)
Show SMILES Sc1nnc(NC(=O)Cn2c3ccccc3oc2=O)s1
Show InChI InChI=1S/C11H8N4O3S2/c16-8(12-9-13-14-10(19)20-9)5-15-6-3-1-2-4-7(6)18-11(15)17/h1-4H,5H2,(H,14,19)(H,12,13,16)
PCBioAssay
n/an/a>1.00E+5n/an/an/an/an/a25
Burnham Center for Chemical Genomics
Curated by PubChem BioAssay
Assay Description
Data Source: Sanford-Burnham Center for Chemical Genomics (SBCCG) Source Affiliation: Sanford-Burnham Medical Research Institute (SBMRI, San Diego, C...
PubChem Bioassay (2011)
BindingDB Entry DOI: 10.7270/Q2CZ35ND