BDBM61026 5-bromanyl-N-(4-methoxy-1,3-benzothiazol-2-yl)thiophene-2-carboxamide::5-bromo-N-(4-methoxy-1,3-benzothiazol-2-yl)-2-thiophenecarboxamide::5-bromo-N-(4-methoxy-1,3-benzothiazol-2-yl)thiophene-2-carboxamide::MLS000569346::SMR000154968::cid_2306986
SMILES: COc1cccc2sc(NC(=O)c3ccc(Br)s3)nc12
InChI Key: InChIKey=WZOVEIOCKHJDIW-UHFFFAOYSA-N
Data: 2 IC50  1 EC50
Activity Spreadsheet -- Enzyme Inhibition Constant Data from BindingDB
Found 3 hits for monomerid = 61026
Trg + Lig
Ki
nM
ΔG°
kcal/mole
IC50
nM
Kd
nM
EC50/IC50
nM
koff
s-1
kon
M-1s-1
pHTemp
°C
G-protein coupled receptor 55
(Homo sapiens (Human))
BDBM61026
(5-bromanyl-N-(4-methoxy-1,3-benzothiazol-2-yl)thio...)
Show SMILES COc1cccc2sc(NC(=O)c3ccc(Br)s3)nc12
Show InChI InChI=1S/C13H9BrN2O2S2/c1-18-7-3-2-4-8-11(7)15-13(20-8)16-12(17)9-5-6-10(14)19-9/h2-6H,1H3,(H,15,16,17)
Reactome pathway
PCBioAssay
n/an/an/an/a 3.20E+4n/an/an/an/a
Burnham Center for Chemical Genomics
Curated by PubChem BioAssay
Assay Description
Data Source: Sanford-Burnham Center for Chemical Genomics (SBCCG) Source Affiliation: Sanford-Burnham Medical Research Institute (SBMRI, San Diego, C...
PubChem Bioassay (2010)
BindingDB Entry DOI: 10.7270/Q2GF0RZ3
photoreceptor-specific nuclear receptor
(Homo sapiens (Human))
BDBM61026
(5-bromanyl-N-(4-methoxy-1,3-benzothiazol-2-yl)thio...)
Show SMILES COc1cccc2sc(NC(=O)c3ccc(Br)s3)nc12
Show InChI InChI=1S/C13H9BrN2O2S2/c1-18-7-3-2-4-8-11(7)15-13(20-8)16-12(17)9-5-6-10(14)19-9/h2-6H,1H3,(H,15,16,17)
Reactome pathway
PCBioAssay
n/an/a 3.41E+3n/an/an/an/an/an/a
The Scripps Research Institute Molecular Screening Center
Curated by PubChem BioAssay
Assay Description
Source (MLPCN Center Name): The Scripps Research Institute Molecular Screening Center Affiliation: The Scripps Research Institute, TSRI Assay Provide...
PubChem Bioassay (2010)
BindingDB Entry DOI: 10.7270/Q2BK19S0
nuclear receptor corepressor 2 isoform 2
(Homo sapiens (Human))
BDBM61026
(5-bromanyl-N-(4-methoxy-1,3-benzothiazol-2-yl)thio...)
Show SMILES COc1cccc2sc(NC(=O)c3ccc(Br)s3)nc12
Show InChI InChI=1S/C13H9BrN2O2S2/c1-18-7-3-2-4-8-11(7)15-13(20-8)16-12(17)9-5-6-10(14)19-9/h2-6H,1H3,(H,15,16,17)
PCBioAssay
n/an/a 2.95E+3n/an/an/an/an/an/a
The Scripps Research Institute Molecular Screening Center
Curated by PubChem BioAssay
Assay Description
Source (MLPCN Center Name): The Scripps Research Institute Molecular Screening Center Affiliation: The Scripps Research Institute, TSRI Assay Provide...
PubChem Bioassay (2010)
BindingDB Entry DOI: 10.7270/Q26T0K34